FailedConsole Output

Started by an SCM change
Building in workspace /var/jenkins_home/workspace/Betaflight Maintenance 3.5
 > git rev-parse --is-inside-work-tree # timeout=10
Fetching changes from the remote Git repository
 > git config remote.origin.url https://github.com/betaflight/betaflight.git # timeout=10
Fetching upstream changes from https://github.com/betaflight/betaflight.git
 > git --version # timeout=10
 > git fetch --tags --progress https://github.com/betaflight/betaflight.git +refs/heads/*:refs/remotes/origin/*
 > git rev-parse origin/3.5.x-maintenance^{commit} # timeout=10
Checking out Revision ed8c45038b3d99b992491c52566dcb1c4ed53bf8 (origin/3.5.x-maintenance)
 > git config core.sparsecheckout # timeout=10
 > git checkout -f ed8c45038b3d99b992491c52566dcb1c4ed53bf8
Commit message: "Merge pull request #7519 from mikeller/fix_cli_profile_setting"
 > git rev-list 404f7e9c64220f951777000df5da8e7332a460c6 # timeout=10
[Betaflight Maintenance 3.5] $ /bin/bash -xe /tmp/jenkins942410219163730477.sh
+ rm -rf obj
[Betaflight Maintenance 3.5] $ /usr/share/nsiq/nsiqcollector --csv -i -l "/var/jenkins_home/workspace/Betaflight Maintenance 3.5/loc.csv" -c "/var/jenkins_home/workspace/Betaflight Maintenance 3.5/complexity.csv" "/var/jenkins_home/workspace/Betaflight Maintenance 3.5/src/main"
============================ Analyzing main ===============================

Filter Scope "default" is applied.
Current Filter Setting (Following is applied sequentially)
/.svn/ is excluded
/.cvs/ is excluded
//target/ is excluded

Current File extension and Language Settings
 JSP/PHP=jsp,php,
 Java=java,
 JavaScript/ActionScript=as,js,
 C/C++=cpp,cxx,c,h,hxx,hpp,
 Html=htm,html,


============================= Summary Report ==============================
 Product LOC - only apply filefilter.txt
 ** Total File Count       : 633
 ** Total LOC      : 130842
 ** Total Code LOC : 84369

 Delta LOC - apply both filefilter.txt and basefilelist.txt
 ** Total File Count : 633
 ** Total LOC        : 130842
 ** Total Code LOC   : 84369

 Delta Complexity - apply both filefilter.txt and basefilelist.txt
 ** Total Delta Function Count : 3629
 ** Delta Over 10 Complexity Function Rate: 271 (7.47%)
 ** Delta Over 30 Complexity Function Rate: 29 (0.80%)


 LOC Distribution Per Lang
                Lang C/C++          
  Product File Count 633            
          LOC        130842         
          Code LOC   84369          
  Delta   File Count 633            
          LOC        130842         
          Code LOC   84369          

File analysis report is saved in /var/jenkins_home/workspace/Betaflight Maintenance 3.5/loc.csv

Complexity analysis report is saved in /var/jenkins_home/workspace/Betaflight Maintenance 3.5/complexity.csv

[Betaflight Maintenance 3.5] $ /bin/bash -xe /tmp/jenkins8925680895393381592.sh
+ /usr/share/pmd/bin/run.sh cpd --minimum-tokens 100 --files src/main --language cpp --format xml
Added /var/jenkins_home/workspace/Betaflight Maintenance 3.5/src/main/vcpf4/stm32f4xx_it.h
Added /var/jenkins_home/workspace/Betaflight Maintenance 3.5/src/main/vcpf4/usbd_cdc_vcp.h
Added /var/jenkins_home/workspace/Betaflight Maintenance 3.5/src/main/vcpf4/usbd_desc.h
Added /var/jenkins_home/workspace/Betaflight Maintenance 3.5/src/main/vcpf4/usb_bsp.c
Added /var/jenkins_home/workspace/Betaflight Maintenance 3.5/src/main/vcpf4/usbd_usr.c
Added /var/jenkins_home/workspace/Betaflight Maintenance 3.5/src/main/vcpf4/stm32f4xx_it.c
Added /var/jenkins_home/workspace/Betaflight Maintenance 3.5/src/main/vcpf4/usbd_conf.h
Added /var/jenkins_home/workspace/Betaflight Maintenance 3.5/src/main/vcpf4/usbd_desc.c
Added /var/jenkins_home/workspace/Betaflight Maintenance 3.5/src/main/vcpf4/usb_conf.h
Added /var/jenkins_home/workspace/Betaflight Maintenance 3.5/src/main/vcpf4/usbd_cdc_vcp.c
Added /var/jenkins_home/workspace/Betaflight Maintenance 3.5/src/main/flight/servos.c
Added /var/jenkins_home/workspace/Betaflight Maintenance 3.5/src/main/flight/mixer.c
Added /var/jenkins_home/workspace/Betaflight Maintenance 3.5/src/main/flight/gps_rescue.h
Added /var/jenkins_home/workspace/Betaflight Maintenance 3.5/src/main/flight/servos_tricopter.c
Added /var/jenkins_home/workspace/Betaflight Maintenance 3.5/src/main/flight/position.c
Added /var/jenkins_home/workspace/Betaflight Maintenance 3.5/src/main/flight/pid.c
Added /var/jenkins_home/workspace/Betaflight Maintenance 3.5/src/main/flight/imu.h
Added /var/jenkins_home/workspace/Betaflight Maintenance 3.5/src/main/flight/mixer_tricopter.c
Added /var/jenkins_home/workspace/Betaflight Maintenance 3.5/src/main/flight/mixer.h
Added /var/jenkins_home/workspace/Betaflight Maintenance 3.5/src/main/flight/failsafe.h
Added /var/jenkins_home/workspace/Betaflight Maintenance 3.5/src/main/flight/servos.h
Added /var/jenkins_home/workspace/Betaflight Maintenance 3.5/src/main/flight/gps_rescue.c
Added /var/jenkins_home/workspace/Betaflight Maintenance 3.5/src/main/flight/position.h
Added /var/jenkins_home/workspace/Betaflight Maintenance 3.5/src/main/flight/failsafe.c
Added /var/jenkins_home/workspace/Betaflight Maintenance 3.5/src/main/flight/imu.c
Added /var/jenkins_home/workspace/Betaflight Maintenance 3.5/src/main/flight/pid.h
Added /var/jenkins_home/workspace/Betaflight Maintenance 3.5/src/main/flight/mixer_tricopter.h
Added /var/jenkins_home/workspace/Betaflight Maintenance 3.5/src/main/target/NOX/target.c
Added /var/jenkins_home/workspace/Betaflight Maintenance 3.5/src/main/target/NOX/config.c
Added /var/jenkins_home/workspace/Betaflight Maintenance 3.5/src/main/target/NOX/target.h
Added /var/jenkins_home/workspace/Betaflight Maintenance 3.5/src/main/target/system_stm32f7xx.h
Added /var/jenkins_home/workspace/Betaflight Maintenance 3.5/src/main/target/IMPULSERCF3/target.c
Added /var/jenkins_home/workspace/Betaflight Maintenance 3.5/src/main/target/IMPULSERCF3/target.h
Added /var/jenkins_home/workspace/Betaflight Maintenance 3.5/src/main/target/CJMCU/target.c
Added /var/jenkins_home/workspace/Betaflight Maintenance 3.5/src/main/target/CJMCU/hardware_revision.h
Added /var/jenkins_home/workspace/Betaflight Maintenance 3.5/src/main/target/CJMCU/initialisation.c
Added /var/jenkins_home/workspace/Betaflight Maintenance 3.5/src/main/target/CJMCU/hardware_revision.c
Added /var/jenkins_home/workspace/Betaflight Maintenance 3.5/src/main/target/CJMCU/target.h
Added /var/jenkins_home/workspace/Betaflight Maintenance 3.5/src/main/target/common_fc_pre.h
Added /var/jenkins_home/workspace/Betaflight Maintenance 3.5/src/main/target/DALRCF405/target.c
Added /var/jenkins_home/workspace/Betaflight Maintenance 3.5/src/main/target/DALRCF405/target.h
Added /var/jenkins_home/workspace/Betaflight Maintenance 3.5/src/main/target/AIR32/target.c
Added /var/jenkins_home/workspace/Betaflight Maintenance 3.5/src/main/target/AIR32/target.h
Added /var/jenkins_home/workspace/Betaflight Maintenance 3.5/src/main/target/HAKRCF411/target.c
Added /var/jenkins_home/workspace/Betaflight Maintenance 3.5/src/main/target/HAKRCF411/target.h
Added /var/jenkins_home/workspace/Betaflight Maintenance 3.5/src/main/target/common_fc_post.h
Added /var/jenkins_home/workspace/Betaflight Maintenance 3.5/src/main/target/IRCFUSIONF3/target.c
Added /var/jenkins_home/workspace/Betaflight Maintenance 3.5/src/main/target/IRCFUSIONF3/target.h
Added /var/jenkins_home/workspace/Betaflight Maintenance 3.5/src/main/target/FF_RACEPIT/target.c
Added /var/jenkins_home/workspace/Betaflight Maintenance 3.5/src/main/target/FF_RACEPIT/config.c
Added /var/jenkins_home/workspace/Betaflight Maintenance 3.5/src/main/target/FF_RACEPIT/target.h
Added /var/jenkins_home/workspace/Betaflight Maintenance 3.5/src/main/target/YUPIF4/target.c
Added /var/jenkins_home/workspace/Betaflight Maintenance 3.5/src/main/target/YUPIF4/hardware_revision.h
Added /var/jenkins_home/workspace/Betaflight Maintenance 3.5/src/main/target/YUPIF4/config.c
Added /var/jenkins_home/workspace/Betaflight Maintenance 3.5/src/main/target/YUPIF4/hardware_revision.c
Added /var/jenkins_home/workspace/Betaflight Maintenance 3.5/src/main/target/YUPIF4/target.h
Added /var/jenkins_home/workspace/Betaflight Maintenance 3.5/src/main/target/SPRACINGF4EVO/target.c
Added /var/jenkins_home/workspace/Betaflight Maintenance 3.5/src/main/target/SPRACINGF4EVO/config.c
Added /var/jenkins_home/workspace/Betaflight Maintenance 3.5/src/main/target/SPRACINGF4EVO/target.h
Added /var/jenkins_home/workspace/Betaflight Maintenance 3.5/src/main/target/RCEXPLORERF3/target.c
Added /var/jenkins_home/workspace/Betaflight Maintenance 3.5/src/main/target/RCEXPLORERF3/target.h
Added /var/jenkins_home/workspace/Betaflight Maintenance 3.5/src/main/target/config_helper.c
Added /var/jenkins_home/workspace/Betaflight Maintenance 3.5/src/main/target/DALRCF722DUAL/target.c
Added /var/jenkins_home/workspace/Betaflight Maintenance 3.5/src/main/target/DALRCF722DUAL/config.c
Added /var/jenkins_home/workspace/Betaflight Maintenance 3.5/src/main/target/DALRCF722DUAL/target.h
Added /var/jenkins_home/workspace/Betaflight Maintenance 3.5/src/main/target/SPEKTRUMF400/target.c
Added /var/jenkins_home/workspace/Betaflight Maintenance 3.5/src/main/target/SPEKTRUMF400/target.h
Added /var/jenkins_home/workspace/Betaflight Maintenance 3.5/src/main/target/STM32F7X2/target.c
Added /var/jenkins_home/workspace/Betaflight Maintenance 3.5/src/main/target/STM32F7X2/target.h
Added /var/jenkins_home/workspace/Betaflight Maintenance 3.5/src/main/target/SPARKY2/target.c
Added /var/jenkins_home/workspace/Betaflight Maintenance 3.5/src/main/target/SPARKY2/target.h
Added /var/jenkins_home/workspace/Betaflight Maintenance 3.5/src/main/target/FOXEERF722DUAL/target.c
Added /var/jenkins_home/workspace/Betaflight Maintenance 3.5/src/main/target/FOXEERF722DUAL/target.h
Added /var/jenkins_home/workspace/Betaflight Maintenance 3.5/src/main/target/MATEKF722SE/target.c
Added /var/jenkins_home/workspace/Betaflight Maintenance 3.5/src/main/target/MATEKF722SE/config.c
Added /var/jenkins_home/workspace/Betaflight Maintenance 3.5/src/main/target/MATEKF722SE/target.h
Added /var/jenkins_home/workspace/Betaflight Maintenance 3.5/src/main/target/JHEF7DUAL/target.c
Added /var/jenkins_home/workspace/Betaflight Maintenance 3.5/src/main/target/JHEF7DUAL/config.c
Added /var/jenkins_home/workspace/Betaflight Maintenance 3.5/src/main/target/JHEF7DUAL/target.h
Added /var/jenkins_home/workspace/Betaflight Maintenance 3.5/src/main/target/CLRACINGF7/target.c
Added /var/jenkins_home/workspace/Betaflight Maintenance 3.5/src/main/target/CLRACINGF7/target.h
Added /var/jenkins_home/workspace/Betaflight Maintenance 3.5/src/main/target/SITL/target.c
Added /var/jenkins_home/workspace/Betaflight Maintenance 3.5/src/main/target/SITL/udplink.c
Added /var/jenkins_home/workspace/Betaflight Maintenance 3.5/src/main/target/SITL/udplink.h
Added /var/jenkins_home/workspace/Betaflight Maintenance 3.5/src/main/target/SITL/target.h
Added /var/jenkins_home/workspace/Betaflight Maintenance 3.5/src/main/target/FF_PIKOBLX/target.c
Added /var/jenkins_home/workspace/Betaflight Maintenance 3.5/src/main/target/FF_PIKOBLX/config.c
Added /var/jenkins_home/workspace/Betaflight Maintenance 3.5/src/main/target/FF_PIKOBLX/target.h
Added /var/jenkins_home/workspace/Betaflight Maintenance 3.5/src/main/target/ALIENFLIGHTNGF7/target.c
Added /var/jenkins_home/workspace/Betaflight Maintenance 3.5/src/main/target/ALIENFLIGHTNGF7/hardware_revision.h
Added /var/jenkins_home/workspace/Betaflight Maintenance 3.5/src/main/target/ALIENFLIGHTNGF7/config.c
Added /var/jenkins_home/workspace/Betaflight Maintenance 3.5/src/main/target/ALIENFLIGHTNGF7/hardware_revision.c
Added /var/jenkins_home/workspace/Betaflight Maintenance 3.5/src/main/target/ALIENFLIGHTNGF7/target.h
Added /var/jenkins_home/workspace/Betaflight Maintenance 3.5/src/main/target/SKYZONEF405/target.c
Added /var/jenkins_home/workspace/Betaflight Maintenance 3.5/src/main/target/SKYZONEF405/target.h
Added /var/jenkins_home/workspace/Betaflight Maintenance 3.5/src/main/target/LUMBAF3/target.c
Added /var/jenkins_home/workspace/Betaflight Maintenance 3.5/src/main/target/LUMBAF3/target.h
Added /var/jenkins_home/workspace/Betaflight Maintenance 3.5/src/main/target/AG3X/target.c
Added /var/jenkins_home/workspace/Betaflight Maintenance 3.5/src/main/target/AG3X/config.c
Added /var/jenkins_home/workspace/Betaflight Maintenance 3.5/src/main/target/AG3X/target.h
Added /var/jenkins_home/workspace/Betaflight Maintenance 3.5/src/main/target/OMNIBUSF4/target.c
Added /var/jenkins_home/workspace/Betaflight Maintenance 3.5/src/main/target/OMNIBUSF4/config.c
Added /var/jenkins_home/workspace/Betaflight Maintenance 3.5/src/main/target/OMNIBUSF4/target.h
Added /var/jenkins_home/workspace/Betaflight Maintenance 3.5/src/main/target/KISSFCV2F7/target.c
Added /var/jenkins_home/workspace/Betaflight Maintenance 3.5/src/main/target/KISSFCV2F7/config.c
Added /var/jenkins_home/workspace/Betaflight Maintenance 3.5/src/main/target/KISSFCV2F7/target.h
Added /var/jenkins_home/workspace/Betaflight Maintenance 3.5/src/main/target/stm32f3xx_hal_conf.h
Added /var/jenkins_home/workspace/Betaflight Maintenance 3.5/src/main/target/SINGULARITY/target.c
Added /var/jenkins_home/workspace/Betaflight Maintenance 3.5/src/main/target/SINGULARITY/target.h
Added /var/jenkins_home/workspace/Betaflight Maintenance 3.5/src/main/target/TINYFISH/target.c
Added /var/jenkins_home/workspace/Betaflight Maintenance 3.5/src/main/target/TINYFISH/config.c
Added /var/jenkins_home/workspace/Betaflight Maintenance 3.5/src/main/target/TINYFISH/target.h
Added /var/jenkins_home/workspace/Betaflight Maintenance 3.5/src/main/target/DOGE/target.c
Added /var/jenkins_home/workspace/Betaflight Maintenance 3.5/src/main/target/DOGE/target.h
Added /var/jenkins_home/workspace/Betaflight Maintenance 3.5/src/main/target/CLRACINGF4/target.c
Added /var/jenkins_home/workspace/Betaflight Maintenance 3.5/src/main/target/CLRACINGF4/target.h
Added /var/jenkins_home/workspace/Betaflight Maintenance 3.5/src/main/target/BEEBRAIN_V2F/target.c
Added /var/jenkins_home/workspace/Betaflight Maintenance 3.5/src/main/target/BEEBRAIN_V2F/config.c
Added /var/jenkins_home/workspace/Betaflight Maintenance 3.5/src/main/target/BEEBRAIN_V2F/target.h
Added /var/jenkins_home/workspace/Betaflight Maintenance 3.5/src/main/target/VRRACE/target.c
Added /var/jenkins_home/workspace/Betaflight Maintenance 3.5/src/main/target/VRRACE/target.h
Added /var/jenkins_home/workspace/Betaflight Maintenance 3.5/src/main/target/HAKRCF722/target.c
Added /var/jenkins_home/workspace/Betaflight Maintenance 3.5/src/main/target/HAKRCF722/target.h
Added /var/jenkins_home/workspace/Betaflight Maintenance 3.5/src/main/target/NERO/target.c
Added /var/jenkins_home/workspace/Betaflight Maintenance 3.5/src/main/target/NERO/target.h
Added /var/jenkins_home/workspace/Betaflight Maintenance 3.5/src/main/target/SPRACINGF3/target.c
Added /var/jenkins_home/workspace/Betaflight Maintenance 3.5/src/main/target/SPRACINGF3/target.h
Added /var/jenkins_home/workspace/Betaflight Maintenance 3.5/src/main/target/common_defaults_post.h
Added /var/jenkins_home/workspace/Betaflight Maintenance 3.5/src/main/target/STM32F4DISCOVERY/target.c
Added /var/jenkins_home/workspace/Betaflight Maintenance 3.5/src/main/target/STM32F4DISCOVERY/target.h
Added /var/jenkins_home/workspace/Betaflight Maintenance 3.5/src/main/target/CRAZYBEEF3FR/target.c
Added /var/jenkins_home/workspace/Betaflight Maintenance 3.5/src/main/target/CRAZYBEEF3FR/target.h
Added /var/jenkins_home/workspace/Betaflight Maintenance 3.5/src/main/target/REVONANO/target.c
Added /var/jenkins_home/workspace/Betaflight Maintenance 3.5/src/main/target/REVONANO/target.h
Added /var/jenkins_home/workspace/Betaflight Maintenance 3.5/src/main/target/STM32F411DISCOVERY/target.c
Added /var/jenkins_home/workspace/Betaflight Maintenance 3.5/src/main/target/STM32F411DISCOVERY/target.h
Added /var/jenkins_home/workspace/Betaflight Maintenance 3.5/src/main/target/SPRACINGF4NEO/target.c
Added /var/jenkins_home/workspace/Betaflight Maintenance 3.5/src/main/target/SPRACINGF4NEO/config.c
Added /var/jenkins_home/workspace/Betaflight Maintenance 3.5/src/main/target/SPRACINGF4NEO/target.h
Added /var/jenkins_home/workspace/Betaflight Maintenance 3.5/src/main/target/KISSFC/target.c
Added /var/jenkins_home/workspace/Betaflight Maintenance 3.5/src/main/target/KISSFC/config.c
Added /var/jenkins_home/workspace/Betaflight Maintenance 3.5/src/main/target/KISSFC/target.h
Added /var/jenkins_home/workspace/Betaflight Maintenance 3.5/src/main/target/OMNINXT/target.c
Added /var/jenkins_home/workspace/Betaflight Maintenance 3.5/src/main/target/OMNINXT/hardware_revision.h
Added /var/jenkins_home/workspace/Betaflight Maintenance 3.5/src/main/target/OMNINXT/config.c
Added /var/jenkins_home/workspace/Betaflight Maintenance 3.5/src/main/target/OMNINXT/hardware_revision.c
Added /var/jenkins_home/workspace/Betaflight Maintenance 3.5/src/main/target/OMNINXT/target.h
Added /var/jenkins_home/workspace/Betaflight Maintenance 3.5/src/main/target/COLIBRI/target.c
Added /var/jenkins_home/workspace/Betaflight Maintenance 3.5/src/main/target/COLIBRI/config.c
Added /var/jenkins_home/workspace/Betaflight Maintenance 3.5/src/main/target/COLIBRI/target.h
Added /var/jenkins_home/workspace/Betaflight Maintenance 3.5/src/main/target/RUSHCORE7/target.c
Added /var/jenkins_home/workspace/Betaflight Maintenance 3.5/src/main/target/RUSHCORE7/target.h
Added /var/jenkins_home/workspace/Betaflight Maintenance 3.5/src/main/target/REVOLT/target.c
Added /var/jenkins_home/workspace/Betaflight Maintenance 3.5/src/main/target/REVOLT/config.c
Added /var/jenkins_home/workspace/Betaflight Maintenance 3.5/src/main/target/REVOLT/target.h
Added /var/jenkins_home/workspace/Betaflight Maintenance 3.5/src/main/target/ALIENWHOOP/target.c
Added /var/jenkins_home/workspace/Betaflight Maintenance 3.5/src/main/target/ALIENWHOOP/config.c
Added /var/jenkins_home/workspace/Betaflight Maintenance 3.5/src/main/target/ALIENWHOOP/target.h
Added /var/jenkins_home/workspace/Betaflight Maintenance 3.5/src/main/target/config_helper.h
Added /var/jenkins_home/workspace/Betaflight Maintenance 3.5/src/main/target/stm32f7xx_hal_conf.h
Added /var/jenkins_home/workspace/Betaflight Maintenance 3.5/src/main/target/NUCLEOF722/target.c
Added /var/jenkins_home/workspace/Betaflight Maintenance 3.5/src/main/target/NUCLEOF722/target.h
Added /var/jenkins_home/workspace/Betaflight Maintenance 3.5/src/main/target/HAKRCF405/target.c
Added /var/jenkins_home/workspace/Betaflight Maintenance 3.5/src/main/target/HAKRCF405/target.h
Added /var/jenkins_home/workspace/Betaflight Maintenance 3.5/src/main/target/FURYF3/target.c
Added /var/jenkins_home/workspace/Betaflight Maintenance 3.5/src/main/target/FURYF3/target.h
Added /var/jenkins_home/workspace/Betaflight Maintenance 3.5/src/main/target/EXF722DUAL/target.c
Added /var/jenkins_home/workspace/Betaflight Maintenance 3.5/src/main/target/EXF722DUAL/target.h
Added /var/jenkins_home/workspace/Betaflight Maintenance 3.5/src/main/target/CC3D/target.c
Added /var/jenkins_home/workspace/Betaflight Maintenance 3.5/src/main/target/CC3D/target.h
Added /var/jenkins_home/workspace/Betaflight Maintenance 3.5/src/main/target/SPRACINGF3EVO/target.c
Added /var/jenkins_home/workspace/Betaflight Maintenance 3.5/src/main/target/SPRACINGF3EVO/config.c
Added /var/jenkins_home/workspace/Betaflight Maintenance 3.5/src/main/target/SPRACINGF3EVO/target.h
Added /var/jenkins_home/workspace/Betaflight Maintenance 3.5/src/main/target/SPEDIXF4/target.c
Added /var/jenkins_home/workspace/Betaflight Maintenance 3.5/src/main/target/SPEDIXF4/config.c
Added /var/jenkins_home/workspace/Betaflight Maintenance 3.5/src/main/target/SPEDIXF4/target.h
Added /var/jenkins_home/workspace/Betaflight Maintenance 3.5/src/main/target/FLYWOOF7DUAL/target.c
Added /var/jenkins_home/workspace/Betaflight Maintenance 3.5/src/main/target/FLYWOOF7DUAL/target.h
Added /var/jenkins_home/workspace/Betaflight Maintenance 3.5/src/main/target/FF_PIKOF4/target.c
Added /var/jenkins_home/workspace/Betaflight Maintenance 3.5/src/main/target/FF_PIKOF4/config.c
Added /var/jenkins_home/workspace/Betaflight Maintenance 3.5/src/main/target/FF_PIKOF4/target.h
Added /var/jenkins_home/workspace/Betaflight Maintenance 3.5/src/main/target/system_stm32f30x.h
Added /var/jenkins_home/workspace/Betaflight Maintenance 3.5/src/main/target/ALIENFLIGHTF1/target.c
Added /var/jenkins_home/workspace/Betaflight Maintenance 3.5/src/main/target/ALIENFLIGHTF1/config.c
Added /var/jenkins_home/workspace/Betaflight Maintenance 3.5/src/main/target/ALIENFLIGHTF1/target.h
Added /var/jenkins_home/workspace/Betaflight Maintenance 3.5/src/main/target/SPRACINGF7DUAL/target.c
Added /var/jenkins_home/workspace/Betaflight Maintenance 3.5/src/main/target/SPRACINGF7DUAL/config.c
Added /var/jenkins_home/workspace/Betaflight Maintenance 3.5/src/main/target/SPRACINGF7DUAL/target.h
Added /var/jenkins_home/workspace/Betaflight Maintenance 3.5/src/main/target/SIRINFPV/target.c
Added /var/jenkins_home/workspace/Betaflight Maintenance 3.5/src/main/target/SIRINFPV/target.h
Added /var/jenkins_home/workspace/Betaflight Maintenance 3.5/src/main/target/CRAZYFLIE2/target.c
Added /var/jenkins_home/workspace/Betaflight Maintenance 3.5/src/main/target/CRAZYFLIE2/serialrx.c
Added /var/jenkins_home/workspace/Betaflight Maintenance 3.5/src/main/target/CRAZYFLIE2/syslink.h
Added /var/jenkins_home/workspace/Betaflight Maintenance 3.5/src/main/target/CRAZYFLIE2/target.h
Added /var/jenkins_home/workspace/Betaflight Maintenance 3.5/src/main/target/CRAZYFLIE2/crtp.h
Added /var/jenkins_home/workspace/Betaflight Maintenance 3.5/src/main/target/ANYFCM7/target.c
Added /var/jenkins_home/workspace/Betaflight Maintenance 3.5/src/main/target/ANYFCM7/target.h
Added /var/jenkins_home/workspace/Betaflight Maintenance 3.5/src/main/target/ALIENFLIGHTF4/target.c
Added /var/jenkins_home/workspace/Betaflight Maintenance 3.5/src/main/target/ALIENFLIGHTF4/hardware_revision.h
Added /var/jenkins_home/workspace/Betaflight Maintenance 3.5/src/main/target/ALIENFLIGHTF4/config.c
Added /var/jenkins_home/workspace/Betaflight Maintenance 3.5/src/main/target/ALIENFLIGHTF4/hardware_revision.c
Added /var/jenkins_home/workspace/Betaflight Maintenance 3.5/src/main/target/ALIENFLIGHTF4/target.h
Added /var/jenkins_home/workspace/Betaflight Maintenance 3.5/src/main/target/STM32F3DISCOVERY/target.c
Added /var/jenkins_home/workspace/Betaflight Maintenance 3.5/src/main/target/STM32F3DISCOVERY/target.h
Added /var/jenkins_home/workspace/Betaflight Maintenance 3.5/src/main/target/stm32f4xx_hal_conf.h
Added /var/jenkins_home/workspace/Betaflight Maintenance 3.5/src/main/target/OMNIBUSF4FW/target.c
Added /var/jenkins_home/workspace/Betaflight Maintenance 3.5/src/main/target/OMNIBUSF4FW/config.c
Added /var/jenkins_home/workspace/Betaflight Maintenance 3.5/src/main/target/OMNIBUSF4FW/target.h
Added /var/jenkins_home/workspace/Betaflight Maintenance 3.5/src/main/target/REVO/target.c
Added /var/jenkins_home/workspace/Betaflight Maintenance 3.5/src/main/target/REVO/config.c
Added /var/jenkins_home/workspace/Betaflight Maintenance 3.5/src/main/target/REVO/target.h
Added /var/jenkins_home/workspace/Betaflight Maintenance 3.5/src/main/target/EACHIF3/target.c
Added /var/jenkins_home/workspace/Betaflight Maintenance 3.5/src/main/target/EACHIF3/target.h
Added /var/jenkins_home/workspace/Betaflight Maintenance 3.5/src/main/target/MULTIFLITEPICO/target.c
Added /var/jenkins_home/workspace/Betaflight Maintenance 3.5/src/main/target/MULTIFLITEPICO/config.c
Added /var/jenkins_home/workspace/Betaflight Maintenance 3.5/src/main/target/MULTIFLITEPICO/target.h
Added /var/jenkins_home/workspace/Betaflight Maintenance 3.5/src/main/target/NUCLEOF7/target.c
Added /var/jenkins_home/workspace/Betaflight Maintenance 3.5/src/main/target/NUCLEOF7/target.h
Added /var/jenkins_home/workspace/Betaflight Maintenance 3.5/src/main/target/KAKUTEF4/target.c
Added /var/jenkins_home/workspace/Betaflight Maintenance 3.5/src/main/target/KAKUTEF4/config.c
Added /var/jenkins_home/workspace/Betaflight Maintenance 3.5/src/main/target/KAKUTEF4/target.h
Added /var/jenkins_home/workspace/Betaflight Maintenance 3.5/src/main/target/YUPIF7/target.c
Added /var/jenkins_home/workspace/Betaflight Maintenance 3.5/src/main/target/YUPIF7/target.h
Added /var/jenkins_home/workspace/Betaflight Maintenance 3.5/src/main/target/FOXEERF405/target.c
Added /var/jenkins_home/workspace/Betaflight Maintenance 3.5/src/main/target/FOXEERF405/target.h
Added /var/jenkins_home/workspace/Betaflight Maintenance 3.5/src/main/target/KROOZX/target.c
Added /var/jenkins_home/workspace/Betaflight Maintenance 3.5/src/main/target/KROOZX/initialisation.c
Added /var/jenkins_home/workspace/Betaflight Maintenance 3.5/src/main/target/KROOZX/config.c
Added /var/jenkins_home/workspace/Betaflight Maintenance 3.5/src/main/target/KROOZX/target.h
Added /var/jenkins_home/workspace/Betaflight Maintenance 3.5/src/main/target/system_stm32f4xx.c
Added /var/jenkins_home/workspace/Betaflight Maintenance 3.5/src/main/target/OMNIBUSF7/target.c
Added /var/jenkins_home/workspace/Betaflight Maintenance 3.5/src/main/target/OMNIBUSF7/config.c
Added /var/jenkins_home/workspace/Betaflight Maintenance 3.5/src/main/target/OMNIBUSF7/target.h
Added /var/jenkins_home/workspace/Betaflight Maintenance 3.5/src/main/target/RG_SSD_F3/target.c
Added /var/jenkins_home/workspace/Betaflight Maintenance 3.5/src/main/target/RG_SSD_F3/config.c
Added /var/jenkins_home/workspace/Betaflight Maintenance 3.5/src/main/target/RG_SSD_F3/target.h
Added /var/jenkins_home/workspace/Betaflight Maintenance 3.5/src/main/target/PYRODRONEF4/target.c
Added /var/jenkins_home/workspace/Betaflight Maintenance 3.5/src/main/target/PYRODRONEF4/target.h
Added /var/jenkins_home/workspace/Betaflight Maintenance 3.5/src/main/target/AIKONF4/target.c
Added /var/jenkins_home/workspace/Betaflight Maintenance 3.5/src/main/target/AIKONF4/target.h
Added /var/jenkins_home/workspace/Betaflight Maintenance 3.5/src/main/target/MATEKF722/target.c
Added /var/jenkins_home/workspace/Betaflight Maintenance 3.5/src/main/target/MATEKF722/target.h
Added /var/jenkins_home/workspace/Betaflight Maintenance 3.5/src/main/target/BETAFLIGHTF4/target.c
Added /var/jenkins_home/workspace/Betaflight Maintenance 3.5/src/main/target/BETAFLIGHTF4/target.h
Added /var/jenkins_home/workspace/Betaflight Maintenance 3.5/src/main/target/OMNIBUS/target.c
Added /var/jenkins_home/workspace/Betaflight Maintenance 3.5/src/main/target/OMNIBUS/target.h
Added /var/jenkins_home/workspace/Betaflight Maintenance 3.5/src/main/target/FISHDRONEF4/target.c
Added /var/jenkins_home/workspace/Betaflight Maintenance 3.5/src/main/target/FISHDRONEF4/target.h
Added /var/jenkins_home/workspace/Betaflight Maintenance 3.5/src/main/target/BETAFLIGHTF3/target.c
Added /var/jenkins_home/workspace/Betaflight Maintenance 3.5/src/main/target/BETAFLIGHTF3/target.h
Added /var/jenkins_home/workspace/Betaflight Maintenance 3.5/src/main/target/MATEKF411/target.c
Added /var/jenkins_home/workspace/Betaflight Maintenance 3.5/src/main/target/MATEKF411/target.h
Added /var/jenkins_home/workspace/Betaflight Maintenance 3.5/src/main/target/COLIBRI_RACE/target.c
Added /var/jenkins_home/workspace/Betaflight Maintenance 3.5/src/main/target/COLIBRI_RACE/i2c_bst.h
Added /var/jenkins_home/workspace/Betaflight Maintenance 3.5/src/main/target/COLIBRI_RACE/bus_bst_stm32f30x.c
Added /var/jenkins_home/workspace/Betaflight Maintenance 3.5/src/main/target/COLIBRI_RACE/target.h
Added /var/jenkins_home/workspace/Betaflight Maintenance 3.5/src/main/target/COLIBRI_RACE/i2c_bst.c
Added /var/jenkins_home/workspace/Betaflight Maintenance 3.5/src/main/target/COLIBRI_RACE/bus_bst.h
Added /var/jenkins_home/workspace/Betaflight Maintenance 3.5/src/main/target/ANYFCF7/target.c
Added /var/jenkins_home/workspace/Betaflight Maintenance 3.5/src/main/target/ANYFCF7/target.h
Added /var/jenkins_home/workspace/Betaflight Maintenance 3.5/src/main/target/LUX_RACE/target.c
Added /var/jenkins_home/workspace/Betaflight Maintenance 3.5/src/main/target/LUX_RACE/target.h
Added /var/jenkins_home/workspace/Betaflight Maintenance 3.5/src/main/target/SPARKY/target.c
Added /var/jenkins_home/workspace/Betaflight Maintenance 3.5/src/main/target/SPARKY/target.h
Added /var/jenkins_home/workspace/Betaflight Maintenance 3.5/src/main/target/MOTOLAB/target.c
Added /var/jenkins_home/workspace/Betaflight Maintenance 3.5/src/main/target/MOTOLAB/config.c
Added /var/jenkins_home/workspace/Betaflight Maintenance 3.5/src/main/target/MOTOLAB/target.h
Added /var/jenkins_home/workspace/Betaflight Maintenance 3.5/src/main/target/FURYF7/target.c
Added /var/jenkins_home/workspace/Betaflight Maintenance 3.5/src/main/target/FURYF7/target.h
Added /var/jenkins_home/workspace/Betaflight Maintenance 3.5/src/main/target/FF_FORTINIF4/target.c
Added /var/jenkins_home/workspace/Betaflight Maintenance 3.5/src/main/target/FF_FORTINIF4/hardware_revision.h
Added /var/jenkins_home/workspace/Betaflight Maintenance 3.5/src/main/target/FF_FORTINIF4/config.c
Added /var/jenkins_home/workspace/Betaflight Maintenance 3.5/src/main/target/FF_FORTINIF4/hardware_revision.c
Added /var/jenkins_home/workspace/Betaflight Maintenance 3.5/src/main/target/FF_FORTINIF4/target.h
Added /var/jenkins_home/workspace/Betaflight Maintenance 3.5/src/main/target/KIWIF4/target.c
Added /var/jenkins_home/workspace/Betaflight Maintenance 3.5/src/main/target/KIWIF4/target.h
Added /var/jenkins_home/workspace/Betaflight Maintenance 3.5/src/main/target/NAZE/target.c
Added /var/jenkins_home/workspace/Betaflight Maintenance 3.5/src/main/target/NAZE/hardware_revision.h
Added /var/jenkins_home/workspace/Betaflight Maintenance 3.5/src/main/target/NAZE/initialisation.c
Added /var/jenkins_home/workspace/Betaflight Maintenance 3.5/src/main/target/NAZE/config.c
Added /var/jenkins_home/workspace/Betaflight Maintenance 3.5/src/main/target/NAZE/hardware_revision.c
Added /var/jenkins_home/workspace/Betaflight Maintenance 3.5/src/main/target/NAZE/target.h
Added /var/jenkins_home/workspace/Betaflight Maintenance 3.5/src/main/target/BLUEJAYF4/target.c
Added /var/jenkins_home/workspace/Betaflight Maintenance 3.5/src/main/target/BLUEJAYF4/hardware_revision.h
Added /var/jenkins_home/workspace/Betaflight Maintenance 3.5/src/main/target/BLUEJAYF4/initialisation.c
Added /var/jenkins_home/workspace/Betaflight Maintenance 3.5/src/main/target/BLUEJAYF4/config.c
Added /var/jenkins_home/workspace/Betaflight Maintenance 3.5/src/main/target/BLUEJAYF4/hardware_revision.c
Added /var/jenkins_home/workspace/Betaflight Maintenance 3.5/src/main/target/BLUEJAYF4/target.h
Added /var/jenkins_home/workspace/Betaflight Maintenance 3.5/src/main/target/UAVPNG030MINI/target.c
Added /var/jenkins_home/workspace/Betaflight Maintenance 3.5/src/main/target/UAVPNG030MINI/target.h
Added /var/jenkins_home/workspace/Betaflight Maintenance 3.5/src/main/target/BEEROTORF4/target.c
Added /var/jenkins_home/workspace/Betaflight Maintenance 3.5/src/main/target/BEEROTORF4/target.h
Added /var/jenkins_home/workspace/Betaflight Maintenance 3.5/src/main/target/CHEBUZZF3/target.c
Added /var/jenkins_home/workspace/Betaflight Maintenance 3.5/src/main/target/CHEBUZZF3/target.h
Added /var/jenkins_home/workspace/Betaflight Maintenance 3.5/src/main/target/MATEKF411RX/target.c
Added /var/jenkins_home/workspace/Betaflight Maintenance 3.5/src/main/target/MATEKF411RX/target.h
Added /var/jenkins_home/workspace/Betaflight Maintenance 3.5/src/main/target/MATEKF405/target.c
Added /var/jenkins_home/workspace/Betaflight Maintenance 3.5/src/main/target/MATEKF405/target.h
Added /var/jenkins_home/workspace/Betaflight Maintenance 3.5/src/main/target/system_stm32f30x.c
Added /var/jenkins_home/workspace/Betaflight Maintenance 3.5/src/main/target/KAKUTEF7/target.c
Added /var/jenkins_home/workspace/Betaflight Maintenance 3.5/src/main/target/KAKUTEF7/target.h
Added /var/jenkins_home/workspace/Betaflight Maintenance 3.5/src/main/target/ISHAPEDF3/target.c
Added /var/jenkins_home/workspace/Betaflight Maintenance 3.5/src/main/target/ISHAPEDF3/target.h
Added /var/jenkins_home/workspace/Betaflight Maintenance 3.5/src/main/target/X_RACERSPI/target.c
Added /var/jenkins_home/workspace/Betaflight Maintenance 3.5/src/main/target/X_RACERSPI/target.h
Added /var/jenkins_home/workspace/Betaflight Maintenance 3.5/src/main/target/FRSKYF3/target.c
Added /var/jenkins_home/workspace/Betaflight Maintenance 3.5/src/main/target/FRSKYF3/config.c
Added /var/jenkins_home/workspace/Betaflight Maintenance 3.5/src/main/target/FRSKYF3/target.h
Added /var/jenkins_home/workspace/Betaflight Maintenance 3.5/src/main/target/stm32f1xx_hal_conf.h
Added /var/jenkins_home/workspace/Betaflight Maintenance 3.5/src/main/target/MICROSCISKY/target.c
Added /var/jenkins_home/workspace/Betaflight Maintenance 3.5/src/main/target/MICROSCISKY/target.h
Added /var/jenkins_home/workspace/Betaflight Maintenance 3.5/src/main/target/F4BY/target.c
Added /var/jenkins_home/workspace/Betaflight Maintenance 3.5/src/main/target/F4BY/target.h
Added /var/jenkins_home/workspace/Betaflight Maintenance 3.5/src/main/target/MOTOLABF4/target.c
Added /var/jenkins_home/workspace/Betaflight Maintenance 3.5/src/main/target/MOTOLABF4/config.c
Added /var/jenkins_home/workspace/Betaflight Maintenance 3.5/src/main/target/MOTOLABF4/target.h
Added /var/jenkins_home/workspace/Betaflight Maintenance 3.5/src/main/target/ALIENFLIGHTF3/target.c
Added /var/jenkins_home/workspace/Betaflight Maintenance 3.5/src/main/target/ALIENFLIGHTF3/hardware_revision.h
Added /var/jenkins_home/workspace/Betaflight Maintenance 3.5/src/main/target/ALIENFLIGHTF3/initialisation.c
Added /var/jenkins_home/workspace/Betaflight Maintenance 3.5/src/main/target/ALIENFLIGHTF3/config.c
Added /var/jenkins_home/workspace/Betaflight Maintenance 3.5/src/main/target/ALIENFLIGHTF3/hardware_revision.c
Added /var/jenkins_home/workspace/Betaflight Maintenance 3.5/src/main/target/ALIENFLIGHTF3/target.h
Added /var/jenkins_home/workspace/Betaflight Maintenance 3.5/src/main/target/SPRACINGF3NEO/target.c
Added /var/jenkins_home/workspace/Betaflight Maintenance 3.5/src/main/target/SPRACINGF3NEO/config.c
Added /var/jenkins_home/workspace/Betaflight Maintenance 3.5/src/main/target/SPRACINGF3NEO/target.h
Added /var/jenkins_home/workspace/Betaflight Maintenance 3.5/src/main/target/SPRACINGF3MINI/target.c
Added /var/jenkins_home/workspace/Betaflight Maintenance 3.5/src/main/target/SPRACINGF3MINI/target.h
Added /var/jenkins_home/workspace/Betaflight Maintenance 3.5/src/main/target/NUCLEOF446RE/target.c
Added /var/jenkins_home/workspace/Betaflight Maintenance 3.5/src/main/target/NUCLEOF446RE/config.c
Added /var/jenkins_home/workspace/Betaflight Maintenance 3.5/src/main/target/NUCLEOF446RE/target.h
Added /var/jenkins_home/workspace/Betaflight Maintenance 3.5/src/main/target/WORMFC/target.c
Added /var/jenkins_home/workspace/Betaflight Maintenance 3.5/src/main/target/WORMFC/target.h
Added /var/jenkins_home/workspace/Betaflight Maintenance 3.5/src/main/target/system_stm32f7xx.c
Added /var/jenkins_home/workspace/Betaflight Maintenance 3.5/src/main/target/RACEBASE/target.c
Added /var/jenkins_home/workspace/Betaflight Maintenance 3.5/src/main/target/RACEBASE/hardware_revision.h
Added /var/jenkins_home/workspace/Betaflight Maintenance 3.5/src/main/target/RACEBASE/config.c
Added /var/jenkins_home/workspace/Betaflight Maintenance 3.5/src/main/target/RACEBASE/hardware_revision.c
Added /var/jenkins_home/workspace/Betaflight Maintenance 3.5/src/main/target/RACEBASE/target.h
Added /var/jenkins_home/workspace/Betaflight Maintenance 3.5/src/main/target/AIRHEROF3/target.c
Added /var/jenkins_home/workspace/Betaflight Maintenance 3.5/src/main/target/AIRHEROF3/target.h
Added /var/jenkins_home/workspace/Betaflight Maintenance 3.5/src/main/target/FURYF4/target.c
Added /var/jenkins_home/workspace/Betaflight Maintenance 3.5/src/main/target/FURYF4/target.h
Added /var/jenkins_home/workspace/Betaflight Maintenance 3.5/src/main/target/FRSKYF4/target.c
Added /var/jenkins_home/workspace/Betaflight Maintenance 3.5/src/main/target/FRSKYF4/config.c
Added /var/jenkins_home/workspace/Betaflight Maintenance 3.5/src/main/target/FRSKYF4/target.h
Added /var/jenkins_home/workspace/Betaflight Maintenance 3.5/src/main/target/ELLE0/target.c
Added /var/jenkins_home/workspace/Betaflight Maintenance 3.5/src/main/target/ELLE0/target.h
Added /var/jenkins_home/workspace/Betaflight Maintenance 3.5/src/main/target/MIDELICF3/target.c
Added /var/jenkins_home/workspace/Betaflight Maintenance 3.5/src/main/target/MIDELICF3/target.h
Added /var/jenkins_home/workspace/Betaflight Maintenance 3.5/src/main/target/SPEEDYBEEF4/target.c
Added /var/jenkins_home/workspace/Betaflight Maintenance 3.5/src/main/target/SPEEDYBEEF4/config.c
Added /var/jenkins_home/workspace/Betaflight Maintenance 3.5/src/main/target/SPEEDYBEEF4/target.h
Added /var/jenkins_home/workspace/Betaflight Maintenance 3.5/src/main/target/system_stm32f4xx.h
Added /var/jenkins_home/workspace/Betaflight Maintenance 3.5/src/main/cms/cms_menu_imu.c
Added /var/jenkins_home/workspace/Betaflight Maintenance 3.5/src/main/cms/cms_menu_vtx_rtc6705.c
Added /var/jenkins_home/workspace/Betaflight Maintenance 3.5/src/main/cms/cms_menu_builtin.h
Added /var/jenkins_home/workspace/Betaflight Maintenance 3.5/src/main/cms/cms_menu_misc.h
Added /var/jenkins_home/workspace/Betaflight Maintenance 3.5/src/main/cms/cms_menu_blackbox.c
Added /var/jenkins_home/workspace/Betaflight Maintenance 3.5/src/main/cms/cms_menu_misc.c
Added /var/jenkins_home/workspace/Betaflight Maintenance 3.5/src/main/cms/cms_menu_ledstrip.c
Added /var/jenkins_home/workspace/Betaflight Maintenance 3.5/src/main/cms/cms_menu_osd.c
Added /var/jenkins_home/workspace/Betaflight Maintenance 3.5/src/main/cms/cms_menu_osd.h
Added /var/jenkins_home/workspace/Betaflight Maintenance 3.5/src/main/cms/cms_menu_power.h
Added /var/jenkins_home/workspace/Betaflight Maintenance 3.5/src/main/cms/cms_menu_vtx_tramp.c
Added /var/jenkins_home/workspace/Betaflight Maintenance 3.5/src/main/cms/cms_types.h
Added /var/jenkins_home/workspace/Betaflight Maintenance 3.5/src/main/cms/cms_menu_vtx_smartaudio.c
Added /var/jenkins_home/workspace/Betaflight Maintenance 3.5/src/main/cms/cms.c
Added /var/jenkins_home/workspace/Betaflight Maintenance 3.5/src/main/cms/cms_menu_builtin.c
Added /var/jenkins_home/workspace/Betaflight Maintenance 3.5/src/main/cms/cms_menu_power.c
Added /var/jenkins_home/workspace/Betaflight Maintenance 3.5/src/main/cms/cms_menu_vtx_smartaudio.h
Added /var/jenkins_home/workspace/Betaflight Maintenance 3.5/src/main/cms/cms_menu_vtx_tramp.h
Added /var/jenkins_home/workspace/Betaflight Maintenance 3.5/src/main/cms/cms_menu_imu.h
Added /var/jenkins_home/workspace/Betaflight Maintenance 3.5/src/main/cms/cms.h
Added /var/jenkins_home/workspace/Betaflight Maintenance 3.5/src/main/cms/cms_menu_vtx_rtc6705.h
Added /var/jenkins_home/workspace/Betaflight Maintenance 3.5/src/main/cms/cms_menu_blackbox.h
Added /var/jenkins_home/workspace/Betaflight Maintenance 3.5/src/main/cms/cms_menu_ledstrip.h
Added /var/jenkins_home/workspace/Betaflight Maintenance 3.5/src/main/drivers/flash.h
Added /var/jenkins_home/workspace/Betaflight Maintenance 3.5/src/main/drivers/pwm_output_dshot_hal.c
Added /var/jenkins_home/workspace/Betaflight Maintenance 3.5/src/main/drivers/sdmmc_sdio.h
Added /var/jenkins_home/workspace/Betaflight Maintenance 3.5/src/main/drivers/bus.c
Added /var/jenkins_home/workspace/Betaflight Maintenance 3.5/src/main/drivers/flash_w25m.c
Added /var/jenkins_home/workspace/Betaflight Maintenance 3.5/src/main/drivers/usb_io.h
Added /var/jenkins_home/workspace/Betaflight Maintenance 3.5/src/main/drivers/pinio.h
Added /var/jenkins_home/workspace/Betaflight Maintenance 3.5/src/main/drivers/light_ws2811strip_stdperiph.c
Added /var/jenkins_home/workspace/Betaflight Maintenance 3.5/src/main/drivers/serial_usb_vcp.c
Added /var/jenkins_home/workspace/Betaflight Maintenance 3.5/src/main/drivers/transponder_ir_ilap.h
Added /var/jenkins_home/workspace/Betaflight Maintenance 3.5/src/main/drivers/sdio_f7xx.c
Added /var/jenkins_home/workspace/Betaflight Maintenance 3.5/src/main/drivers/buf_writer.h
Added /var/jenkins_home/workspace/Betaflight Maintenance 3.5/src/main/drivers/max7456_symbols.h
Added /var/jenkins_home/workspace/Betaflight Maintenance 3.5/src/main/drivers/serial_uart.h
Added /var/jenkins_home/workspace/Betaflight Maintenance 3.5/src/main/drivers/io_types.h
Added /var/jenkins_home/workspace/Betaflight Maintenance 3.5/src/main/drivers/serial_softserial.h
Added /var/jenkins_home/workspace/Betaflight Maintenance 3.5/src/main/drivers/time.h
Added /var/jenkins_home/workspace/Betaflight Maintenance 3.5/src/main/drivers/rcc.h
Added /var/jenkins_home/workspace/Betaflight Maintenance 3.5/src/main/drivers/timer_stm32f10x.c
Added /var/jenkins_home/workspace/Betaflight Maintenance 3.5/src/main/drivers/usb_msc_f4xx.c
Added /var/jenkins_home/workspace/Betaflight Maintenance 3.5/src/main/drivers/usb_io.c
Added /var/jenkins_home/workspace/Betaflight Maintenance 3.5/src/main/drivers/stm32f7xx_ll_ex.h
Added /var/jenkins_home/workspace/Betaflight Maintenance 3.5/src/main/drivers/stack_check.h
Added /var/jenkins_home/workspace/Betaflight Maintenance 3.5/src/main/drivers/timer_hal.c
Added /var/jenkins_home/workspace/Betaflight Maintenance 3.5/src/main/drivers/serial_pinconfig.c
Added /var/jenkins_home/workspace/Betaflight Maintenance 3.5/src/main/drivers/serial_uart.c
Added /var/jenkins_home/workspace/Betaflight Maintenance 3.5/src/main/drivers/serial_uart_stm32f4xx.c
Added /var/jenkins_home/workspace/Betaflight Maintenance 3.5/src/main/drivers/io.c
Added /var/jenkins_home/workspace/Betaflight Maintenance 3.5/src/main/drivers/system_stm32f10x.c
Added /var/jenkins_home/workspace/Betaflight Maintenance 3.5/src/main/drivers/sdcard.h
Added /var/jenkins_home/workspace/Betaflight Maintenance 3.5/src/main/drivers/timer_impl.h
Added /var/jenkins_home/workspace/Betaflight Maintenance 3.5/src/main/drivers/dma_stm32f7xx.c
Added /var/jenkins_home/workspace/Betaflight Maintenance 3.5/src/main/drivers/serial_softserial.c
Added /var/jenkins_home/workspace/Betaflight Maintenance 3.5/src/main/drivers/adc_stm32f10x.c
Added /var/jenkins_home/workspace/Betaflight Maintenance 3.5/src/main/drivers/light_led.h
Added /var/jenkins_home/workspace/Betaflight Maintenance 3.5/src/main/drivers/sound_beeper.h
Added /var/jenkins_home/workspace/Betaflight Maintenance 3.5/src/main/drivers/exti.c
Added /var/jenkins_home/workspace/Betaflight Maintenance 3.5/src/main/drivers/light_ws2811strip_hal.c
Added /var/jenkins_home/workspace/Betaflight Maintenance 3.5/src/main/drivers/timer.h
Added /var/jenkins_home/workspace/Betaflight Maintenance 3.5/src/main/drivers/serial.c
Added /var/jenkins_home/workspace/Betaflight Maintenance 3.5/src/main/drivers/buttons.c
Added /var/jenkins_home/workspace/Betaflight Maintenance 3.5/src/main/drivers/flash.c
Added /var/jenkins_home/workspace/Betaflight Maintenance 3.5/src/main/drivers/dma_stm32f4xx.c
Added /var/jenkins_home/workspace/Betaflight Maintenance 3.5/src/main/drivers/stack_check.c
Added /var/jenkins_home/workspace/Betaflight Maintenance 3.5/src/main/drivers/buttons.h
Added /var/jenkins_home/workspace/Betaflight Maintenance 3.5/src/main/drivers/serial_uart_init.c
Added /var/jenkins_home/workspace/Betaflight Maintenance 3.5/src/main/drivers/adc_impl.h
Added /var/jenkins_home/workspace/Betaflight Maintenance 3.5/src/main/drivers/inverter.c
Added /var/jenkins_home/workspace/Betaflight Maintenance 3.5/src/main/drivers/rcc_types.h
Added /var/jenkins_home/workspace/Betaflight Maintenance 3.5/src/main/drivers/bus_spi_stdperiph.c
Added /var/jenkins_home/workspace/Betaflight Maintenance 3.5/src/main/drivers/sdcard_standard.c
Added /var/jenkins_home/workspace/Betaflight Maintenance 3.5/src/main/drivers/light_ws2811strip.c
Added /var/jenkins_home/workspace/Betaflight Maintenance 3.5/src/main/drivers/system.h
Added /var/jenkins_home/workspace/Betaflight Maintenance 3.5/src/main/drivers/serial_uart_pinconfig.c
Added /var/jenkins_home/workspace/Betaflight Maintenance 3.5/src/main/drivers/dma.h
Added /var/jenkins_home/workspace/Betaflight Maintenance 3.5/src/main/drivers/adc_stm32f7xx.c
Added /var/jenkins_home/workspace/Betaflight Maintenance 3.5/src/main/drivers/transponder_ir_erlt.c
Added /var/jenkins_home/workspace/Betaflight Maintenance 3.5/src/main/drivers/serial_escserial.c
Added /var/jenkins_home/workspace/Betaflight Maintenance 3.5/src/main/drivers/timer_def.h
Added /var/jenkins_home/workspace/Betaflight Maintenance 3.5/src/main/drivers/display.c
Added /var/jenkins_home/workspace/Betaflight Maintenance 3.5/src/main/drivers/transponder_ir_erlt.h
Added /var/jenkins_home/workspace/Betaflight Maintenance 3.5/src/main/drivers/light_ws2811strip.h
Added /var/jenkins_home/workspace/Betaflight Maintenance 3.5/src/main/drivers/bus_spi_pinconfig.c
Added /var/jenkins_home/workspace/Betaflight Maintenance 3.5/src/main/drivers/bus_i2c_stm32f10x.c
Added /var/jenkins_home/workspace/Betaflight Maintenance 3.5/src/main/drivers/transponder_ir_arcitimer.h
Added /var/jenkins_home/workspace/Betaflight Maintenance 3.5/src/main/drivers/sdcard_sdio_baremetal.c
Added /var/jenkins_home/workspace/Betaflight Maintenance 3.5/src/main/drivers/camera_control.h
Added /var/jenkins_home/workspace/Betaflight Maintenance 3.5/src/main/drivers/bus_i2c_stm32f30x.c
Added /var/jenkins_home/workspace/Betaflight Maintenance 3.5/src/main/drivers/usb_msc_f7xx.c
Added /var/jenkins_home/workspace/Betaflight Maintenance 3.5/src/main/drivers/serial_tcp.h
Added /var/jenkins_home/workspace/Betaflight Maintenance 3.5/src/main/drivers/sound_beeper.c
Added /var/jenkins_home/workspace/Betaflight Maintenance 3.5/src/main/drivers/bus_spi.h
Added /var/jenkins_home/workspace/Betaflight Maintenance 3.5/src/main/drivers/bus_i2c_config.c
Added /var/jenkins_home/workspace/Betaflight Maintenance 3.5/src/main/drivers/sdcard.c
Added /var/jenkins_home/workspace/Betaflight Maintenance 3.5/src/main/drivers/barometer/barometer_bmp085.h
Added /var/jenkins_home/workspace/Betaflight Maintenance 3.5/src/main/drivers/barometer/barometer_lps.c
Added /var/jenkins_home/workspace/Betaflight Maintenance 3.5/src/main/drivers/barometer/barometer_bmp085.c
Added /var/jenkins_home/workspace/Betaflight Maintenance 3.5/src/main/drivers/barometer/barometer_ms5611.h
Added /var/jenkins_home/workspace/Betaflight Maintenance 3.5/src/main/drivers/barometer/barometer_bmp280.h
Added /var/jenkins_home/workspace/Betaflight Maintenance 3.5/src/main/drivers/barometer/barometer_fake.h
Added /var/jenkins_home/workspace/Betaflight Maintenance 3.5/src/main/drivers/barometer/barometer_qmp6988.c
Added /var/jenkins_home/workspace/Betaflight Maintenance 3.5/src/main/drivers/barometer/barometer_qmp6988.h
Added /var/jenkins_home/workspace/Betaflight Maintenance 3.5/src/main/drivers/barometer/barometer_lps.h
Added /var/jenkins_home/workspace/Betaflight Maintenance 3.5/src/main/drivers/barometer/barometer_ms5611.c
Added /var/jenkins_home/workspace/Betaflight Maintenance 3.5/src/main/drivers/barometer/barometer.h
Added /var/jenkins_home/workspace/Betaflight Maintenance 3.5/src/main/drivers/barometer/barometer_bmp280.c
Added /var/jenkins_home/workspace/Betaflight Maintenance 3.5/src/main/drivers/barometer/barometer_fake.c
Added /var/jenkins_home/workspace/Betaflight Maintenance 3.5/src/main/drivers/max7456.h
Added /var/jenkins_home/workspace/Betaflight Maintenance 3.5/src/main/drivers/exti.h
Added /var/jenkins_home/workspace/Betaflight Maintenance 3.5/src/main/drivers/bus_spi.c
Added /var/jenkins_home/workspace/Betaflight Maintenance 3.5/src/main/drivers/accgyro_legacy/accgyro_mma845x.h
Added /var/jenkins_home/workspace/Betaflight Maintenance 3.5/src/main/drivers/accgyro_legacy/accgyro_l3gd20.c
Added /var/jenkins_home/workspace/Betaflight Maintenance 3.5/src/main/drivers/accgyro_legacy/accgyro_l3g4200d.h
Added /var/jenkins_home/workspace/Betaflight Maintenance 3.5/src/main/drivers/accgyro_legacy/accgyro_l3g4200d.c
Added /var/jenkins_home/workspace/Betaflight Maintenance 3.5/src/main/drivers/accgyro_legacy/accgyro_lsm303dlhc.c
Added /var/jenkins_home/workspace/Betaflight Maintenance 3.5/src/main/drivers/accgyro_legacy/accgyro_mma845x.c
Added /var/jenkins_home/workspace/Betaflight Maintenance 3.5/src/main/drivers/accgyro_legacy/accgyro_adxl345.c
Added /var/jenkins_home/workspace/Betaflight Maintenance 3.5/src/main/drivers/accgyro_legacy/accgyro_lsm303dlhc.h
Added /var/jenkins_home/workspace/Betaflight Maintenance 3.5/src/main/drivers/accgyro_legacy/accgyro_bma280.h
Added /var/jenkins_home/workspace/Betaflight Maintenance 3.5/src/main/drivers/accgyro_legacy/accgyro_bma280.c
Added /var/jenkins_home/workspace/Betaflight Maintenance 3.5/src/main/drivers/accgyro_legacy/accgyro_l3gd20.h
Added /var/jenkins_home/workspace/Betaflight Maintenance 3.5/src/main/drivers/accgyro_legacy/accgyro_adxl345.h
Added /var/jenkins_home/workspace/Betaflight Maintenance 3.5/src/main/drivers/resource.c
Added /var/jenkins_home/workspace/Betaflight Maintenance 3.5/src/main/drivers/serial_uart_stm32f10x.c
Added /var/jenkins_home/workspace/Betaflight Maintenance 3.5/src/main/drivers/serial_uart_stm32f30x.c
Added /var/jenkins_home/workspace/Betaflight Maintenance 3.5/src/main/drivers/adc_stm32f4xx.c
Added /var/jenkins_home/workspace/Betaflight Maintenance 3.5/src/main/drivers/nvic.h
Added /var/jenkins_home/workspace/Betaflight Maintenance 3.5/src/main/drivers/bus_i2c_impl.h
Added /var/jenkins_home/workspace/Betaflight Maintenance 3.5/src/main/drivers/io_impl.h
Added /var/jenkins_home/workspace/Betaflight Maintenance 3.5/src/main/drivers/timer_stm32f7xx.c
Added /var/jenkins_home/workspace/Betaflight Maintenance 3.5/src/main/drivers/display.h
Added /var/jenkins_home/workspace/Betaflight Maintenance 3.5/src/main/drivers/usb_msc.h
Added /var/jenkins_home/workspace/Betaflight Maintenance 3.5/src/main/drivers/vtx_common.c
Added /var/jenkins_home/workspace/Betaflight Maintenance 3.5/src/main/drivers/rx/rx_spi.c
Added /var/jenkins_home/workspace/Betaflight Maintenance 3.5/src/main/drivers/rx/rx_nrf24l01.h
Added /var/jenkins_home/workspace/Betaflight Maintenance 3.5/src/main/drivers/rx/rx_nrf24l01.c
Added /var/jenkins_home/workspace/Betaflight Maintenance 3.5/src/main/drivers/rx/rx_xn297.c
Added /var/jenkins_home/workspace/Betaflight Maintenance 3.5/src/main/drivers/rx/rx_pwm.h
Added /var/jenkins_home/workspace/Betaflight Maintenance 3.5/src/main/drivers/rx/rx_cc2500.h
Added /var/jenkins_home/workspace/Betaflight Maintenance 3.5/src/main/drivers/rx/rx_xn297.h
Added /var/jenkins_home/workspace/Betaflight Maintenance 3.5/src/main/drivers/rx/rx_cc2500.c
Added /var/jenkins_home/workspace/Betaflight Maintenance 3.5/src/main/drivers/rx/rx_spi.h
Added /var/jenkins_home/workspace/Betaflight Maintenance 3.5/src/main/drivers/rx/rx_pwm.c
Added /var/jenkins_home/workspace/Betaflight Maintenance 3.5/src/main/drivers/rx/rx_a7105.c
Added /var/jenkins_home/workspace/Betaflight Maintenance 3.5/src/main/drivers/rx/rx_a7105.h
Added /var/jenkins_home/workspace/Betaflight Maintenance 3.5/src/main/drivers/timer.c
Added /var/jenkins_home/workspace/Betaflight Maintenance 3.5/src/main/drivers/io_def_generated.h
Added /var/jenkins_home/workspace/Betaflight Maintenance 3.5/src/main/drivers/timer_common.c
Added /var/jenkins_home/workspace/Betaflight Maintenance 3.5/src/main/drivers/pwm_output.c
Added /var/jenkins_home/workspace/Betaflight Maintenance 3.5/src/main/drivers/rangefinder/rangefinder_hcsr04.h
Added /var/jenkins_home/workspace/Betaflight Maintenance 3.5/src/main/drivers/rangefinder/rangefinder_lidartf.h
Added /var/jenkins_home/workspace/Betaflight Maintenance 3.5/src/main/drivers/rangefinder/rangefinder.h
Added /var/jenkins_home/workspace/Betaflight Maintenance 3.5/src/main/drivers/rangefinder/rangefinder_lidartf.c
Added /var/jenkins_home/workspace/Betaflight Maintenance 3.5/src/main/drivers/rangefinder/rangefinder_hcsr04.c
Added /var/jenkins_home/workspace/Betaflight Maintenance 3.5/src/main/drivers/system_stm32f4xx.c
Added /var/jenkins_home/workspace/Betaflight Maintenance 3.5/src/main/drivers/serial_tcp.c
Added /var/jenkins_home/workspace/Betaflight Maintenance 3.5/src/main/drivers/camera_control.c
Added /var/jenkins_home/workspace/Betaflight Maintenance 3.5/src/main/drivers/accgyro/accgyro_mpu6050.c
Added /var/jenkins_home/workspace/Betaflight Maintenance 3.5/src/main/drivers/accgyro/accgyro_spi_mpu6500.h
Added /var/jenkins_home/workspace/Betaflight Maintenance 3.5/src/main/drivers/accgyro/accgyro_spi_icm20649.h
Added /var/jenkins_home/workspace/Betaflight Maintenance 3.5/src/main/drivers/accgyro/gyro_sync.h
Added /var/jenkins_home/workspace/Betaflight Maintenance 3.5/src/main/drivers/accgyro/accgyro_spi_icm20649.c
Added /var/jenkins_home/workspace/Betaflight Maintenance 3.5/src/main/drivers/accgyro/accgyro_fake.c
Added /var/jenkins_home/workspace/Betaflight Maintenance 3.5/src/main/drivers/accgyro/accgyro_mpu6500.h
Added /var/jenkins_home/workspace/Betaflight Maintenance 3.5/src/main/drivers/accgyro/gyro_sync.c
Added /var/jenkins_home/workspace/Betaflight Maintenance 3.5/src/main/drivers/accgyro/accgyro.h
Added /var/jenkins_home/workspace/Betaflight Maintenance 3.5/src/main/drivers/accgyro/accgyro_mpu.c
Added /var/jenkins_home/workspace/Betaflight Maintenance 3.5/src/main/drivers/accgyro/accgyro_mpu3050.h
Added /var/jenkins_home/workspace/Betaflight Maintenance 3.5/src/main/drivers/accgyro/accgyro_spi_icm20689.h
Added /var/jenkins_home/workspace/Betaflight Maintenance 3.5/src/main/drivers/accgyro/accgyro_spi_mpu6500.c
Added /var/jenkins_home/workspace/Betaflight Maintenance 3.5/src/main/drivers/accgyro/accgyro_spi_icm20689.c
Added /var/jenkins_home/workspace/Betaflight Maintenance 3.5/src/main/drivers/accgyro/accgyro_mpu.h
Added /var/jenkins_home/workspace/Betaflight Maintenance 3.5/src/main/drivers/accgyro/accgyro_spi_bmi160.c
Added /var/jenkins_home/workspace/Betaflight Maintenance 3.5/src/main/drivers/accgyro/accgyro_spi_mpu6000.h
Added /var/jenkins_home/workspace/Betaflight Maintenance 3.5/src/main/drivers/accgyro/accgyro_fake.h
Added /var/jenkins_home/workspace/Betaflight Maintenance 3.5/src/main/drivers/accgyro/accgyro_spi_mpu9250.c
Added /var/jenkins_home/workspace/Betaflight Maintenance 3.5/src/main/drivers/accgyro/accgyro_spi_bmi160.h
Added /var/jenkins_home/workspace/Betaflight Maintenance 3.5/src/main/drivers/accgyro/accgyro_mpu6500.c
Added /var/jenkins_home/workspace/Betaflight Maintenance 3.5/src/main/drivers/accgyro/accgyro_spi_mpu6000.c
Added /var/jenkins_home/workspace/Betaflight Maintenance 3.5/src/main/drivers/accgyro/accgyro_spi_mpu9250.h
Added /var/jenkins_home/workspace/Betaflight Maintenance 3.5/src/main/drivers/accgyro/accgyro_mpu3050.c
Added /var/jenkins_home/workspace/Betaflight Maintenance 3.5/src/main/drivers/accgyro/accgyro_mpu6050.h
Added /var/jenkins_home/workspace/Betaflight Maintenance 3.5/src/main/drivers/serial_uart_hal.c
Added /var/jenkins_home/workspace/Betaflight Maintenance 3.5/src/main/drivers/pwm_output_counts.h
Added /var/jenkins_home/workspace/Betaflight Maintenance 3.5/src/main/drivers/rcc.c
Added /var/jenkins_home/workspace/Betaflight Maintenance 3.5/src/main/drivers/dma.c
Added /var/jenkins_home/workspace/Betaflight Maintenance 3.5/src/main/drivers/audio_stm32f7xx.c
Added /var/jenkins_home/workspace/Betaflight Maintenance 3.5/src/main/drivers/bus_spi_config.c
Added /var/jenkins_home/workspace/Betaflight Maintenance 3.5/src/main/drivers/bus_i2c.h
Added /var/jenkins_home/workspace/Betaflight Maintenance 3.5/src/main/drivers/pwm_output_dshot.c
Added /var/jenkins_home/workspace/Betaflight Maintenance 3.5/src/main/drivers/compass/compass_qmc5883l.c
Added /var/jenkins_home/workspace/Betaflight Maintenance 3.5/src/main/drivers/compass/compass_fake.c
Added /var/jenkins_home/workspace/Betaflight Maintenance 3.5/src/main/drivers/compass/compass_ak8963.c
Added /var/jenkins_home/workspace/Betaflight Maintenance 3.5/src/main/drivers/compass/compass_ak8975.h
Added /var/jenkins_home/workspace/Betaflight Maintenance 3.5/src/main/drivers/compass/compass.h
Added /var/jenkins_home/workspace/Betaflight Maintenance 3.5/src/main/drivers/compass/compass_fake.h
Added /var/jenkins_home/workspace/Betaflight Maintenance 3.5/src/main/drivers/compass/compass_hmc5883l.h
Added /var/jenkins_home/workspace/Betaflight Maintenance 3.5/src/main/drivers/compass/compass_qmc5883l.h
Added /var/jenkins_home/workspace/Betaflight Maintenance 3.5/src/main/drivers/compass/compass_ak8975.c
Added /var/jenkins_home/workspace/Betaflight Maintenance 3.5/src/main/drivers/compass/compass_hmc5883l.c
Added /var/jenkins_home/workspace/Betaflight Maintenance 3.5/src/main/drivers/compass/compass_ak8963.h
Added /var/jenkins_home/workspace/Betaflight Maintenance 3.5/src/main/drivers/serial_escserial.h
Added /var/jenkins_home/workspace/Betaflight Maintenance 3.5/src/main/drivers/serial_usb_vcp.h
Added /var/jenkins_home/workspace/Betaflight Maintenance 3.5/src/main/drivers/transponder_ir.h
Added /var/jenkins_home/workspace/Betaflight Maintenance 3.5/src/main/drivers/transponder_ir_arcitimer.c
Added /var/jenkins_home/workspace/Betaflight Maintenance 3.5/src/main/drivers/transponder_ir_io_hal.c
Added /var/jenkins_home/workspace/Betaflight Maintenance 3.5/src/main/drivers/transponder_ir_io_stdperiph.c
Added /var/jenkins_home/workspace/Betaflight Maintenance 3.5/src/main/drivers/inverter.h
Added /var/jenkins_home/workspace/Betaflight Maintenance 3.5/src/main/drivers/sdio_f4xx.c
Added /var/jenkins_home/workspace/Betaflight Maintenance 3.5/src/main/drivers/bus_spi_ll.c
Added /var/jenkins_home/workspace/Betaflight Maintenance 3.5/src/main/drivers/pwm_esc_detect.c
Added /var/jenkins_home/workspace/Betaflight Maintenance 3.5/src/main/drivers/flash_impl.h
Added /var/jenkins_home/workspace/Betaflight Maintenance 3.5/src/main/drivers/sdcard_standard.h
Added /var/jenkins_home/workspace/Betaflight Maintenance 3.5/src/main/drivers/sensor.h
Added /var/jenkins_home/workspace/Betaflight Maintenance 3.5/src/main/drivers/audio.h
Added /var/jenkins_home/workspace/Betaflight Maintenance 3.5/src/main/drivers/pwm_esc_detect.h
Added /var/jenkins_home/workspace/Betaflight Maintenance 3.5/src/main/drivers/display_ug2864hsweg01.h
Added /var/jenkins_home/workspace/Betaflight Maintenance 3.5/src/main/drivers/pinio.c
Added /var/jenkins_home/workspace/Betaflight Maintenance 3.5/src/main/drivers/serial_uart_impl.h
Added /var/jenkins_home/workspace/Betaflight Maintenance 3.5/src/main/drivers/flash_w25m.h
Added /var/jenkins_home/workspace/Betaflight Maintenance 3.5/src/main/drivers/max7456.c
Added /var/jenkins_home/workspace/Betaflight Maintenance 3.5/src/main/drivers/resource.h
Added /var/jenkins_home/workspace/Betaflight Maintenance 3.5/src/main/drivers/bus_i2c_busdev.c
Added /var/jenkins_home/workspace/Betaflight Maintenance 3.5/src/main/drivers/vtx_rtc6705.h
Added /var/jenkins_home/workspace/Betaflight Maintenance 3.5/src/main/drivers/io.h
Added /var/jenkins_home/workspace/Betaflight Maintenance 3.5/src/main/drivers/system_stm32f30x.c
Added /var/jenkins_home/workspace/Betaflight Maintenance 3.5/src/main/drivers/timer_stm32f30x.c
Added /var/jenkins_home/workspace/Betaflight Maintenance 3.5/src/main/drivers/display_ug2864hsweg01.c
Added /var/jenkins_home/workspace/Betaflight Maintenance 3.5/src/main/drivers/timer_stm32f4xx.c
Added /var/jenkins_home/workspace/Betaflight Maintenance 3.5/src/main/drivers/adc.h
Added /var/jenkins_home/workspace/Betaflight Maintenance 3.5/src/main/drivers/serial.h
Added /var/jenkins_home/workspace/Betaflight Maintenance 3.5/src/main/drivers/vtx_rtc6705.c
Added /var/jenkins_home/workspace/Betaflight Maintenance 3.5/src/main/drivers/bus_spi_impl.h
Added /var/jenkins_home/workspace/Betaflight Maintenance 3.5/src/main/drivers/serial_uart_stm32f7xx.c
Added /var/jenkins_home/workspace/Betaflight Maintenance 3.5/src/main/drivers/io_def.h
Added /var/jenkins_home/workspace/Betaflight Maintenance 3.5/src/main/drivers/bus.h
Added /var/jenkins_home/workspace/Betaflight Maintenance 3.5/src/main/drivers/flash_m25p16.c
Added /var/jenkins_home/workspace/Betaflight Maintenance 3.5/src/main/drivers/transponder_ir_ilap.c
Added /var/jenkins_home/workspace/Betaflight Maintenance 3.5/src/main/drivers/flash_m25p16.h
Added /var/jenkins_home/workspace/Betaflight Maintenance 3.5/src/main/drivers/vtx_rtc6705_soft_spi.c
Added /var/jenkins_home/workspace/Betaflight Maintenance 3.5/src/main/drivers/system.c
Added /var/jenkins_home/workspace/Betaflight Maintenance 3.5/src/main/drivers/bus_i2c_hal.c
Added /var/jenkins_home/workspace/Betaflight Maintenance 3.5/src/main/drivers/bus_i2c_busdev.h
Added /var/jenkins_home/workspace/Betaflight Maintenance 3.5/src/main/drivers/vtx_common.h
Added /var/jenkins_home/workspace/Betaflight Maintenance 3.5/src/main/drivers/system_stm32f7xx.c
Added /var/jenkins_home/workspace/Betaflight Maintenance 3.5/src/main/drivers/buf_writer.c
Added /var/jenkins_home/workspace/Betaflight Maintenance 3.5/src/main/drivers/pwm_output.h
Added /var/jenkins_home/workspace/Betaflight Maintenance 3.5/src/main/drivers/adc_stm32f30x.c
Added /var/jenkins_home/workspace/Betaflight Maintenance 3.5/src/main/drivers/bus_i2c_soft.c
Added /var/jenkins_home/workspace/Betaflight Maintenance 3.5/src/main/drivers/light_led.c
Added /var/jenkins_home/workspace/Betaflight Maintenance 3.5/src/main/drivers/adc.c
Added /var/jenkins_home/workspace/Betaflight Maintenance 3.5/src/main/io/spektrum_rssi.h
Added /var/jenkins_home/workspace/Betaflight Maintenance 3.5/src/main/io/usb_cdc_hid.h
Added /var/jenkins_home/workspace/Betaflight Maintenance 3.5/src/main/io/serial_4way.c
Added /var/jenkins_home/workspace/Betaflight Maintenance 3.5/src/main/io/displayport_crsf.h
Added /var/jenkins_home/workspace/Betaflight Maintenance 3.5/src/main/io/rcdevice_cam.h
Added /var/jenkins_home/workspace/Betaflight Maintenance 3.5/src/main/io/usb_cdc_hid.c
Added /var/jenkins_home/workspace/Betaflight Maintenance 3.5/src/main/io/gimbal.h
Added /var/jenkins_home/workspace/Betaflight Maintenance 3.5/src/main/io/gps.h
Added /var/jenkins_home/workspace/Betaflight Maintenance 3.5/src/main/io/serial.c
Added /var/jenkins_home/workspace/Betaflight Maintenance 3.5/src/main/io/displayport_crsf.c
Added /var/jenkins_home/workspace/Betaflight Maintenance 3.5/src/main/io/vtx_smartaudio.h
Added /var/jenkins_home/workspace/Betaflight Maintenance 3.5/src/main/io/flashfs.h
Added /var/jenkins_home/workspace/Betaflight Maintenance 3.5/src/main/io/serial_4way_stk500v2.c
Added /var/jenkins_home/workspace/Betaflight Maintenance 3.5/src/main/io/spektrum_rssi.c
Added /var/jenkins_home/workspace/Betaflight Maintenance 3.5/src/main/io/ledstrip.c
Added /var/jenkins_home/workspace/Betaflight Maintenance 3.5/src/main/io/rcdevice.h
Added /var/jenkins_home/workspace/Betaflight Maintenance 3.5/src/main/io/spektrum_vtx_control.h
Added /var/jenkins_home/workspace/Betaflight Maintenance 3.5/src/main/io/vtx_tramp.c
Added /var/jenkins_home/workspace/Betaflight Maintenance 3.5/src/main/io/spektrum_vtx_control.c
Added /var/jenkins_home/workspace/Betaflight Maintenance 3.5/src/main/io/piniobox.c
Added /var/jenkins_home/workspace/Betaflight Maintenance 3.5/src/main/io/piniobox.h
Added /var/jenkins_home/workspace/Betaflight Maintenance 3.5/src/main/io/displayport_oled.h
Added /var/jenkins_home/workspace/Betaflight Maintenance 3.5/src/main/io/displayport_max7456.h
Added /var/jenkins_home/workspace/Betaflight Maintenance 3.5/src/main/io/vtx_string.c
Added /var/jenkins_home/workspace/Betaflight Maintenance 3.5/src/main/io/vtx.c
Added /var/jenkins_home/workspace/Betaflight Maintenance 3.5/src/main/io/vtx_smartaudio.c
Added /var/jenkins_home/workspace/Betaflight Maintenance 3.5/src/main/io/vtx_tramp.h
Added /var/jenkins_home/workspace/Betaflight Maintenance 3.5/src/main/io/statusindicator.c
Added /var/jenkins_home/workspace/Betaflight Maintenance 3.5/src/main/io/dashboard.h
Added /var/jenkins_home/workspace/Betaflight Maintenance 3.5/src/main/io/servos.h
Added /var/jenkins_home/workspace/Betaflight Maintenance 3.5/src/main/io/serial_4way.h
Added /var/jenkins_home/workspace/Betaflight Maintenance 3.5/src/main/io/displayport_oled.c
Added /var/jenkins_home/workspace/Betaflight Maintenance 3.5/src/main/io/ledstrip.h
Added /var/jenkins_home/workspace/Betaflight Maintenance 3.5/src/main/io/usb_msc.h
Added /var/jenkins_home/workspace/Betaflight Maintenance 3.5/src/main/io/beeper.c
Added /var/jenkins_home/workspace/Betaflight Maintenance 3.5/src/main/io/usb_msc.c
Added /var/jenkins_home/workspace/Betaflight Maintenance 3.5/src/main/io/displayport_srxl.c
Added /var/jenkins_home/workspace/Betaflight Maintenance 3.5/src/main/io/pidaudio.h
Added /var/jenkins_home/workspace/Betaflight Maintenance 3.5/src/main/io/pidaudio.c
Added /var/jenkins_home/workspace/Betaflight Maintenance 3.5/src/main/io/transponder_ir.c
Added /var/jenkins_home/workspace/Betaflight Maintenance 3.5/src/main/io/displayport_max7456.c
Added /var/jenkins_home/workspace/Betaflight Maintenance 3.5/src/main/io/displayport_msp.h
Added /var/jenkins_home/workspace/Betaflight Maintenance 3.5/src/main/io/rcdevice.c
Added /var/jenkins_home/workspace/Betaflight Maintenance 3.5/src/main/io/transponder_ir.h
Added /var/jenkins_home/workspace/Betaflight Maintenance 3.5/src/main/io/vtx.h
Added /var/jenkins_home/workspace/Betaflight Maintenance 3.5/src/main/io/displayport_msp.c
Added /var/jenkins_home/workspace/Betaflight Maintenance 3.5/src/main/io/motors.h
Added /var/jenkins_home/workspace/Betaflight Maintenance 3.5/src/main/io/serial_4way_stk500v2.h
Added /var/jenkins_home/workspace/Betaflight Maintenance 3.5/src/main/io/statusindicator.h
Added /var/jenkins_home/workspace/Betaflight Maintenance 3.5/src/main/io/serial_4way_impl.h
Added /var/jenkins_home/workspace/Betaflight Maintenance 3.5/src/main/io/osd.h
Added /var/jenkins_home/workspace/Betaflight Maintenance 3.5/src/main/io/osd.c
Added /var/jenkins_home/workspace/Betaflight Maintenance 3.5/src/main/io/vtx_control.c
Added /var/jenkins_home/workspace/Betaflight Maintenance 3.5/src/main/io/vtx_rtc6705.h
Added /var/jenkins_home/workspace/Betaflight Maintenance 3.5/src/main/io/beeper.h
Added /var/jenkins_home/workspace/Betaflight Maintenance 3.5/src/main/io/serial_4way_avrootloader.h
Added /var/jenkins_home/workspace/Betaflight Maintenance 3.5/src/main/io/flashfs.c
Added /var/jenkins_home/workspace/Betaflight Maintenance 3.5/src/main/io/vtx_string.h
Added /var/jenkins_home/workspace/Betaflight Maintenance 3.5/src/main/io/serial.h
Added /var/jenkins_home/workspace/Betaflight Maintenance 3.5/src/main/io/vtx_rtc6705.c
Added /var/jenkins_home/workspace/Betaflight Maintenance 3.5/src/main/io/displayport_srxl.h
Added /var/jenkins_home/workspace/Betaflight Maintenance 3.5/src/main/io/dashboard.c
Added /var/jenkins_home/workspace/Betaflight Maintenance 3.5/src/main/io/rcdevice_cam.c
Added /var/jenkins_home/workspace/Betaflight Maintenance 3.5/src/main/io/gps.c
Added /var/jenkins_home/workspace/Betaflight Maintenance 3.5/src/main/io/asyncfatfs/fat_standard.c
Added /var/jenkins_home/workspace/Betaflight Maintenance 3.5/src/main/io/asyncfatfs/asyncfatfs.c
Added /var/jenkins_home/workspace/Betaflight Maintenance 3.5/src/main/io/asyncfatfs/fat_standard.h
Added /var/jenkins_home/workspace/Betaflight Maintenance 3.5/src/main/io/asyncfatfs/asyncfatfs.h
Added /var/jenkins_home/workspace/Betaflight Maintenance 3.5/src/main/io/serial_4way_avrootloader.c
Added /var/jenkins_home/workspace/Betaflight Maintenance 3.5/src/main/io/vtx_control.h
Added /var/jenkins_home/workspace/Betaflight Maintenance 3.5/src/main/interface/cli.c
Added /var/jenkins_home/workspace/Betaflight Maintenance 3.5/src/main/interface/tramp_protocol.c
Added /var/jenkins_home/workspace/Betaflight Maintenance 3.5/src/main/interface/smartaudio_protocol.h
Added /var/jenkins_home/workspace/Betaflight Maintenance 3.5/src/main/interface/tramp_protocol.h
Added /var/jenkins_home/workspace/Betaflight Maintenance 3.5/src/main/interface/smartaudio_protocol.c
Added /var/jenkins_home/workspace/Betaflight Maintenance 3.5/src/main/interface/cli.h
Added /var/jenkins_home/workspace/Betaflight Maintenance 3.5/src/main/interface/settings.c
Added /var/jenkins_home/workspace/Betaflight Maintenance 3.5/src/main/interface/msp_protocol.h
Added /var/jenkins_home/workspace/Betaflight Maintenance 3.5/src/main/interface/msp_box.h
Added /var/jenkins_home/workspace/Betaflight Maintenance 3.5/src/main/interface/msp_box.c
Added /var/jenkins_home/workspace/Betaflight Maintenance 3.5/src/main/interface/crsf_protocol.h
Added /var/jenkins_home/workspace/Betaflight Maintenance 3.5/src/main/interface/settings.h
Added /var/jenkins_home/workspace/Betaflight Maintenance 3.5/src/main/interface/msp.c
Added /var/jenkins_home/workspace/Betaflight Maintenance 3.5/src/main/interface/msp.h
Added /var/jenkins_home/workspace/Betaflight Maintenance 3.5/src/main/telemetry/srxl.c
Added /var/jenkins_home/workspace/Betaflight Maintenance 3.5/src/main/telemetry/hott.h
Added /var/jenkins_home/workspace/Betaflight Maintenance 3.5/src/main/telemetry/smartport.c
Added /var/jenkins_home/workspace/Betaflight Maintenance 3.5/src/main/telemetry/telemetry.h
Added /var/jenkins_home/workspace/Betaflight Maintenance 3.5/src/main/telemetry/crsf.c
Added /var/jenkins_home/workspace/Betaflight Maintenance 3.5/src/main/telemetry/ltm.h
Added /var/jenkins_home/workspace/Betaflight Maintenance 3.5/src/main/telemetry/frsky_hub.h
Added /var/jenkins_home/workspace/Betaflight Maintenance 3.5/src/main/telemetry/msp_shared.c
Added /var/jenkins_home/workspace/Betaflight Maintenance 3.5/src/main/telemetry/telemetry.c
Added /var/jenkins_home/workspace/Betaflight Maintenance 3.5/src/main/telemetry/jetiexbus.h
Added /var/jenkins_home/workspace/Betaflight Maintenance 3.5/src/main/telemetry/jetiexbus.c
Added /var/jenkins_home/workspace/Betaflight Maintenance 3.5/src/main/telemetry/hott.c
Added /var/jenkins_home/workspace/Betaflight Maintenance 3.5/src/main/telemetry/msp_shared.h
Added /var/jenkins_home/workspace/Betaflight Maintenance 3.5/src/main/telemetry/frsky_hub.c
Added /var/jenkins_home/workspace/Betaflight Maintenance 3.5/src/main/telemetry/crsf.h
Added /var/jenkins_home/workspace/Betaflight Maintenance 3.5/src/main/telemetry/ibus.h
Added /var/jenkins_home/workspace/Betaflight Maintenance 3.5/src/main/telemetry/mavlink.h
Added /var/jenkins_home/workspace/Betaflight Maintenance 3.5/src/main/telemetry/smartport.h
Added /var/jenkins_home/workspace/Betaflight Maintenance 3.5/src/main/telemetry/ltm.c
Added /var/jenkins_home/workspace/Betaflight Maintenance 3.5/src/main/telemetry/srxl.h
Added /var/jenkins_home/workspace/Betaflight Maintenance 3.5/src/main/telemetry/ibus_shared.h
Added /var/jenkins_home/workspace/Betaflight Maintenance 3.5/src/main/telemetry/ibus_shared.c
Added /var/jenkins_home/workspace/Betaflight Maintenance 3.5/src/main/telemetry/mavlink.c
Added /var/jenkins_home/workspace/Betaflight Maintenance 3.5/src/main/telemetry/ibus.c
Added /var/jenkins_home/workspace/Betaflight Maintenance 3.5/src/main/main.c
Added /var/jenkins_home/workspace/Betaflight Maintenance 3.5/src/main/ctype.h
Added /var/jenkins_home/workspace/Betaflight Maintenance 3.5/src/main/platform.h
Added /var/jenkins_home/workspace/Betaflight Maintenance 3.5/src/main/common/crc.c
Added /var/jenkins_home/workspace/Betaflight Maintenance 3.5/src/main/common/printf.c
Added /var/jenkins_home/workspace/Betaflight Maintenance 3.5/src/main/common/filter.h
Added /var/jenkins_home/workspace/Betaflight Maintenance 3.5/src/main/common/color.h
Added /var/jenkins_home/workspace/Betaflight Maintenance 3.5/src/main/common/time.h
Added /var/jenkins_home/workspace/Betaflight Maintenance 3.5/src/main/common/gps_conversion.h
Added /var/jenkins_home/workspace/Betaflight Maintenance 3.5/src/main/common/huffman.c
Added /var/jenkins_home/workspace/Betaflight Maintenance 3.5/src/main/common/colorconversion.h
Added /var/jenkins_home/workspace/Betaflight Maintenance 3.5/src/main/common/maths.c
Added /var/jenkins_home/workspace/Betaflight Maintenance 3.5/src/main/common/string_light.c
Added /var/jenkins_home/workspace/Betaflight Maintenance 3.5/src/main/common/typeconversion.c
Added /var/jenkins_home/workspace/Betaflight Maintenance 3.5/src/main/common/maths.h
Added /var/jenkins_home/workspace/Betaflight Maintenance 3.5/src/main/common/time.c
Added /var/jenkins_home/workspace/Betaflight Maintenance 3.5/src/main/common/strtol.h
Added /var/jenkins_home/workspace/Betaflight Maintenance 3.5/src/main/common/bitarray.h
Added /var/jenkins_home/workspace/Betaflight Maintenance 3.5/src/main/common/filter.c
Added /var/jenkins_home/workspace/Betaflight Maintenance 3.5/src/main/common/printf.h
Added /var/jenkins_home/workspace/Betaflight Maintenance 3.5/src/main/common/streambuf.h
Added /var/jenkins_home/workspace/Betaflight Maintenance 3.5/src/main/common/axis.h
Added /var/jenkins_home/workspace/Betaflight Maintenance 3.5/src/main/common/typeconversion.h
Added /var/jenkins_home/workspace/Betaflight Maintenance 3.5/src/main/common/gps_conversion.c
Added /var/jenkins_home/workspace/Betaflight Maintenance 3.5/src/main/common/crc.h
Added /var/jenkins_home/workspace/Betaflight Maintenance 3.5/src/main/common/huffman_table.c
Added /var/jenkins_home/workspace/Betaflight Maintenance 3.5/src/main/common/utils.h
Added /var/jenkins_home/workspace/Betaflight Maintenance 3.5/src/main/common/encoding.c
Added /var/jenkins_home/workspace/Betaflight Maintenance 3.5/src/main/common/huffman.h
Added /var/jenkins_home/workspace/Betaflight Maintenance 3.5/src/main/common/strtol.c
Added /var/jenkins_home/workspace/Betaflight Maintenance 3.5/src/main/common/colorconversion.c
Added /var/jenkins_home/workspace/Betaflight Maintenance 3.5/src/main/common/bitarray.c
Added /var/jenkins_home/workspace/Betaflight Maintenance 3.5/src/main/common/streambuf.c
Added /var/jenkins_home/workspace/Betaflight Maintenance 3.5/src/main/common/encoding.h
Added /var/jenkins_home/workspace/Betaflight Maintenance 3.5/src/main/common/explog_approx.c
Added /var/jenkins_home/workspace/Betaflight Maintenance 3.5/src/main/rx/cc2500_frsky_shared.c
Added /var/jenkins_home/workspace/Betaflight Maintenance 3.5/src/main/rx/sbus.h
Added /var/jenkins_home/workspace/Betaflight Maintenance 3.5/src/main/rx/sumd.c
Added /var/jenkins_home/workspace/Betaflight Maintenance 3.5/src/main/rx/spektrum.h
Added /var/jenkins_home/workspace/Betaflight Maintenance 3.5/src/main/rx/rx_spi.c
Added /var/jenkins_home/workspace/Betaflight Maintenance 3.5/src/main/rx/xbus.h
Added /var/jenkins_home/workspace/Betaflight Maintenance 3.5/src/main/rx/cc2500_frsky_x.c
Added /var/jenkins_home/workspace/Betaflight Maintenance 3.5/src/main/rx/fport.c
Added /var/jenkins_home/workspace/Betaflight Maintenance 3.5/src/main/rx/pwm.c
Added /var/jenkins_home/workspace/Betaflight Maintenance 3.5/src/main/rx/nrf24_kn.c
Added /var/jenkins_home/workspace/Betaflight Maintenance 3.5/src/main/rx/nrf24_cx10.c
Added /var/jenkins_home/workspace/Betaflight Maintenance 3.5/src/main/rx/rx.c
Added /var/jenkins_home/workspace/Betaflight Maintenance 3.5/src/main/rx/targetcustomserial.h
Added /var/jenkins_home/workspace/Betaflight Maintenance 3.5/src/main/rx/sbus.c
Added /var/jenkins_home/workspace/Betaflight Maintenance 3.5/src/main/rx/flysky_defs.h
Added /var/jenkins_home/workspace/Betaflight Maintenance 3.5/src/main/rx/sbus_channels.h
Added /var/jenkins_home/workspace/Betaflight Maintenance 3.5/src/main/rx/sbus_channels.c
Added /var/jenkins_home/workspace/Betaflight Maintenance 3.5/src/main/rx/nrf24_syma.h
Added /var/jenkins_home/workspace/Betaflight Maintenance 3.5/src/main/rx/nrf24_h8_3d.c
Added /var/jenkins_home/workspace/Betaflight Maintenance 3.5/src/main/rx/nrf24_inav.c
Added /var/jenkins_home/workspace/Betaflight Maintenance 3.5/src/main/rx/nrf24_v202.h
Added /var/jenkins_home/workspace/Betaflight Maintenance 3.5/src/main/rx/sumd.h
Added /var/jenkins_home/workspace/Betaflight Maintenance 3.5/src/main/rx/cc2500_frsky_shared.h
Added /var/jenkins_home/workspace/Betaflight Maintenance 3.5/src/main/rx/crsf.c
Added /var/jenkins_home/workspace/Betaflight Maintenance 3.5/src/main/rx/rx.h
Added /var/jenkins_home/workspace/Betaflight Maintenance 3.5/src/main/rx/nrf24_cx10.h
Added /var/jenkins_home/workspace/Betaflight Maintenance 3.5/src/main/rx/jetiexbus.h
Added /var/jenkins_home/workspace/Betaflight Maintenance 3.5/src/main/rx/jetiexbus.c
Added /var/jenkins_home/workspace/Betaflight Maintenance 3.5/src/main/rx/sumh.h
Added /var/jenkins_home/workspace/Betaflight Maintenance 3.5/src/main/rx/flysky.c
Added /var/jenkins_home/workspace/Betaflight Maintenance 3.5/src/main/rx/cc2500_frsky_x.h
Added /var/jenkins_home/workspace/Betaflight Maintenance 3.5/src/main/rx/nrf24_kn.h
Added /var/jenkins_home/workspace/Betaflight Maintenance 3.5/src/main/rx/cc2500_frsky_d.h
Added /var/jenkins_home/workspace/Betaflight Maintenance 3.5/src/main/rx/crsf.h
Added /var/jenkins_home/workspace/Betaflight Maintenance 3.5/src/main/rx/cc2500_frsky_d.c
Added /var/jenkins_home/workspace/Betaflight Maintenance 3.5/src/main/rx/ibus.h
Added /var/jenkins_home/workspace/Betaflight Maintenance 3.5/src/main/rx/nrf24_v202.c
Added /var/jenkins_home/workspace/Betaflight Maintenance 3.5/src/main/rx/msp.c
Added /var/jenkins_home/workspace/Betaflight Maintenance 3.5/src/main/rx/sumh.c
Added /var/jenkins_home/workspace/Betaflight Maintenance 3.5/src/main/rx/spektrum.c
Added /var/jenkins_home/workspace/Betaflight Maintenance 3.5/src/main/rx/msp.h
Added /var/jenkins_home/workspace/Betaflight Maintenance 3.5/src/main/rx/pwm.h
Added /var/jenkins_home/workspace/Betaflight Maintenance 3.5/src/main/rx/rx_spi.h
Added /var/jenkins_home/workspace/Betaflight Maintenance 3.5/src/main/rx/xbus.c
Added /var/jenkins_home/workspace/Betaflight Maintenance 3.5/src/main/rx/cc2500_frsky_common.h
Added /var/jenkins_home/workspace/Betaflight Maintenance 3.5/src/main/rx/nrf24_inav.h
Added /var/jenkins_home/workspace/Betaflight Maintenance 3.5/src/main/rx/nrf24_h8_3d.h
Added /var/jenkins_home/workspace/Betaflight Maintenance 3.5/src/main/rx/fport.h
Added /var/jenkins_home/workspace/Betaflight Maintenance 3.5/src/main/rx/nrf24_syma.c
Added /var/jenkins_home/workspace/Betaflight Maintenance 3.5/src/main/rx/ibus.c
Added /var/jenkins_home/workspace/Betaflight Maintenance 3.5/src/main/rx/flysky.h
Added /var/jenkins_home/workspace/Betaflight Maintenance 3.5/src/main/pg/flash.h
Added /var/jenkins_home/workspace/Betaflight Maintenance 3.5/src/main/pg/board.c
Added /var/jenkins_home/workspace/Betaflight Maintenance 3.5/src/main/pg/beeper_dev.h
Added /var/jenkins_home/workspace/Betaflight Maintenance 3.5/src/main/pg/pinio.h
Added /var/jenkins_home/workspace/Betaflight Maintenance 3.5/src/main/pg/rx_spi.c
Added /var/jenkins_home/workspace/Betaflight Maintenance 3.5/src/main/pg/vcd.c
Added /var/jenkins_home/workspace/Betaflight Maintenance 3.5/src/main/pg/rx.c
Added /var/jenkins_home/workspace/Betaflight Maintenance 3.5/src/main/pg/sdcard.h
Added /var/jenkins_home/workspace/Betaflight Maintenance 3.5/src/main/pg/flash.c
Added /var/jenkins_home/workspace/Betaflight Maintenance 3.5/src/main/pg/sdio.c
Added /var/jenkins_home/workspace/Betaflight Maintenance 3.5/src/main/pg/rcdevice.h
Added /var/jenkins_home/workspace/Betaflight Maintenance 3.5/src/main/pg/piniobox.c
Added /var/jenkins_home/workspace/Betaflight Maintenance 3.5/src/main/pg/piniobox.h
Added /var/jenkins_home/workspace/Betaflight Maintenance 3.5/src/main/pg/bus_i2c.c
Added /var/jenkins_home/workspace/Betaflight Maintenance 3.5/src/main/pg/timerio.c
Added /var/jenkins_home/workspace/Betaflight Maintenance 3.5/src/main/pg/rx.h
Added /var/jenkins_home/workspace/Betaflight Maintenance 3.5/src/main/pg/bus_spi.h
Added /var/jenkins_home/workspace/Betaflight Maintenance 3.5/src/main/pg/sdcard.c
Added /var/jenkins_home/workspace/Betaflight Maintenance 3.5/src/main/pg/max7456.h
Added /var/jenkins_home/workspace/Betaflight Maintenance 3.5/src/main/pg/pg.c
Added /var/jenkins_home/workspace/Betaflight Maintenance 3.5/src/main/pg/bus_spi.c
Added /var/jenkins_home/workspace/Betaflight Maintenance 3.5/src/main/pg/pg.h
Added /var/jenkins_home/workspace/Betaflight Maintenance 3.5/src/main/pg/dashboard.h
Added /var/jenkins_home/workspace/Betaflight Maintenance 3.5/src/main/pg/beeper.c
Added /var/jenkins_home/workspace/Betaflight Maintenance 3.5/src/main/pg/rx_pwm.h
Added /var/jenkins_home/workspace/Betaflight Maintenance 3.5/src/main/pg/pg_ids.h
Added /var/jenkins_home/workspace/Betaflight Maintenance 3.5/src/main/pg/board.h
Added /var/jenkins_home/workspace/Betaflight Maintenance 3.5/src/main/pg/usb.h
Added /var/jenkins_home/workspace/Betaflight Maintenance 3.5/src/main/pg/rcdevice.c
Added /var/jenkins_home/workspace/Betaflight Maintenance 3.5/src/main/pg/bus_i2c.h
Added /var/jenkins_home/workspace/Betaflight Maintenance 3.5/src/main/pg/pinio.c
Added /var/jenkins_home/workspace/Betaflight Maintenance 3.5/src/main/pg/rx_spi.h
Added /var/jenkins_home/workspace/Betaflight Maintenance 3.5/src/main/pg/max7456.c
Added /var/jenkins_home/workspace/Betaflight Maintenance 3.5/src/main/pg/usb.c
Added /var/jenkins_home/workspace/Betaflight Maintenance 3.5/src/main/pg/vcd.h
Added /var/jenkins_home/workspace/Betaflight Maintenance 3.5/src/main/pg/beeper.h
Added /var/jenkins_home/workspace/Betaflight Maintenance 3.5/src/main/pg/adc.h
Added /var/jenkins_home/workspace/Betaflight Maintenance 3.5/src/main/pg/dashboard.c
Added /var/jenkins_home/workspace/Betaflight Maintenance 3.5/src/main/pg/beeper_dev.c
Added /var/jenkins_home/workspace/Betaflight Maintenance 3.5/src/main/pg/sdio.h
Added /var/jenkins_home/workspace/Betaflight Maintenance 3.5/src/main/pg/rx_pwm.c
Added /var/jenkins_home/workspace/Betaflight Maintenance 3.5/src/main/pg/timerio.h
Added /var/jenkins_home/workspace/Betaflight Maintenance 3.5/src/main/pg/adc.c
Added /var/jenkins_home/workspace/Betaflight Maintenance 3.5/src/main/vcp/usb_desc.h
Added /var/jenkins_home/workspace/Betaflight Maintenance 3.5/src/main/vcp/usb_prop.h
Added /var/jenkins_home/workspace/Betaflight Maintenance 3.5/src/main/vcp/stm32_it.c
Added /var/jenkins_home/workspace/Betaflight Maintenance 3.5/src/main/vcp/usb_pwr.h
Added /var/jenkins_home/workspace/Betaflight Maintenance 3.5/src/main/vcp/usb_istr.c
Added /var/jenkins_home/workspace/Betaflight Maintenance 3.5/src/main/vcp/usb_istr.h
Added /var/jenkins_home/workspace/Betaflight Maintenance 3.5/src/main/vcp/stm32_it.h
Added /var/jenkins_home/workspace/Betaflight Maintenance 3.5/src/main/vcp/hw_config.c
Added /var/jenkins_home/workspace/Betaflight Maintenance 3.5/src/main/vcp/usb_pwr.c
Added /var/jenkins_home/workspace/Betaflight Maintenance 3.5/src/main/vcp/platform_config.h
Added /var/jenkins_home/workspace/Betaflight Maintenance 3.5/src/main/vcp/usb_desc.c
Added /var/jenkins_home/workspace/Betaflight Maintenance 3.5/src/main/vcp/usb_prop.c
Added /var/jenkins_home/workspace/Betaflight Maintenance 3.5/src/main/vcp/hw_config.h
Added /var/jenkins_home/workspace/Betaflight Maintenance 3.5/src/main/vcp/usb_endp.c
Added /var/jenkins_home/workspace/Betaflight Maintenance 3.5/src/main/vcp/usb_conf.h
Added /var/jenkins_home/workspace/Betaflight Maintenance 3.5/src/main/msp/msp_serial.h
Added /var/jenkins_home/workspace/Betaflight Maintenance 3.5/src/main/msp/msp_serial.c
Added /var/jenkins_home/workspace/Betaflight Maintenance 3.5/src/main/config/feature.c
Added /var/jenkins_home/workspace/Betaflight Maintenance 3.5/src/main/config/config_reset.h
Added /var/jenkins_home/workspace/Betaflight Maintenance 3.5/src/main/config/feature.h
Added /var/jenkins_home/workspace/Betaflight Maintenance 3.5/src/main/config/config_streamer.h
Added /var/jenkins_home/workspace/Betaflight Maintenance 3.5/src/main/config/config_streamer.c
Added /var/jenkins_home/workspace/Betaflight Maintenance 3.5/src/main/config/config_eeprom.c
Added /var/jenkins_home/workspace/Betaflight Maintenance 3.5/src/main/config/config_unittest.h
Added /var/jenkins_home/workspace/Betaflight Maintenance 3.5/src/main/config/config_eeprom.h
Added /var/jenkins_home/workspace/Betaflight Maintenance 3.5/src/main/scheduler/scheduler.h
Added /var/jenkins_home/workspace/Betaflight Maintenance 3.5/src/main/scheduler/scheduler.c
Added /var/jenkins_home/workspace/Betaflight Maintenance 3.5/src/main/blackbox/blackbox_io.c
Added /var/jenkins_home/workspace/Betaflight Maintenance 3.5/src/main/blackbox/blackbox.c
Added /var/jenkins_home/workspace/Betaflight Maintenance 3.5/src/main/blackbox/blackbox_fielddefs.h
Added /var/jenkins_home/workspace/Betaflight Maintenance 3.5/src/main/blackbox/blackbox_encoding.h
Added /var/jenkins_home/workspace/Betaflight Maintenance 3.5/src/main/blackbox/blackbox_io.h
Added /var/jenkins_home/workspace/Betaflight Maintenance 3.5/src/main/blackbox/blackbox.h
Added /var/jenkins_home/workspace/Betaflight Maintenance 3.5/src/main/blackbox/blackbox_encoding.c
Added /var/jenkins_home/workspace/Betaflight Maintenance 3.5/src/main/sensors/rangefinder.c
Added /var/jenkins_home/workspace/Betaflight Maintenance 3.5/src/main/sensors/gyro.c
Added /var/jenkins_home/workspace/Betaflight Maintenance 3.5/src/main/sensors/adcinternal.h
Added /var/jenkins_home/workspace/Betaflight Maintenance 3.5/src/main/sensors/current.c
Added /var/jenkins_home/workspace/Betaflight Maintenance 3.5/src/main/sensors/initialisation.c
Added /var/jenkins_home/workspace/Betaflight Maintenance 3.5/src/main/sensors/sensors.h
Added /var/jenkins_home/workspace/Betaflight Maintenance 3.5/src/main/sensors/gyro_filter_impl.h
Added /var/jenkins_home/workspace/Betaflight Maintenance 3.5/src/main/sensors/initialisation.h
Added /var/jenkins_home/workspace/Betaflight Maintenance 3.5/src/main/sensors/esc_sensor.c
Added /var/jenkins_home/workspace/Betaflight Maintenance 3.5/src/main/sensors/voltage.c
Added /var/jenkins_home/workspace/Betaflight Maintenance 3.5/src/main/sensors/voltage_ids.h
Added /var/jenkins_home/workspace/Betaflight Maintenance 3.5/src/main/sensors/barometer.c
Added /var/jenkins_home/workspace/Betaflight Maintenance 3.5/src/main/sensors/compass.h
Added /var/jenkins_home/workspace/Betaflight Maintenance 3.5/src/main/sensors/current_ids.h
Added /var/jenkins_home/workspace/Betaflight Maintenance 3.5/src/main/sensors/boardalignment.c
Added /var/jenkins_home/workspace/Betaflight Maintenance 3.5/src/main/sensors/rangefinder.h
Added /var/jenkins_home/workspace/Betaflight Maintenance 3.5/src/main/sensors/adcinternal.c
Added /var/jenkins_home/workspace/Betaflight Maintenance 3.5/src/main/sensors/esc_sensor.h
Added /var/jenkins_home/workspace/Betaflight Maintenance 3.5/src/main/sensors/acceleration.h
Added /var/jenkins_home/workspace/Betaflight Maintenance 3.5/src/main/sensors/gyro.h
Added /var/jenkins_home/workspace/Betaflight Maintenance 3.5/src/main/sensors/compass.c
Added /var/jenkins_home/workspace/Betaflight Maintenance 3.5/src/main/sensors/voltage.h
Added /var/jenkins_home/workspace/Betaflight Maintenance 3.5/src/main/sensors/gyroanalyse.h
Added /var/jenkins_home/workspace/Betaflight Maintenance 3.5/src/main/sensors/barometer.h
Added /var/jenkins_home/workspace/Betaflight Maintenance 3.5/src/main/sensors/gyroanalyse.c
Added /var/jenkins_home/workspace/Betaflight Maintenance 3.5/src/main/sensors/battery.c
Added /var/jenkins_home/workspace/Betaflight Maintenance 3.5/src/main/sensors/current.h
Added /var/jenkins_home/workspace/Betaflight Maintenance 3.5/src/main/sensors/battery.h
Added /var/jenkins_home/workspace/Betaflight Maintenance 3.5/src/main/sensors/acceleration.c
Added /var/jenkins_home/workspace/Betaflight Maintenance 3.5/src/main/sensors/boardalignment.h
Added /var/jenkins_home/workspace/Betaflight Maintenance 3.5/src/main/vcp_hal/usbd_cdc_interface.h
Added /var/jenkins_home/workspace/Betaflight Maintenance 3.5/src/main/vcp_hal/usbd_conf.c
Added /var/jenkins_home/workspace/Betaflight Maintenance 3.5/src/main/vcp_hal/usbd_desc.h
Added /var/jenkins_home/workspace/Betaflight Maintenance 3.5/src/main/vcp_hal/usbd_cdc_interface.c
Added /var/jenkins_home/workspace/Betaflight Maintenance 3.5/src/main/vcp_hal/usbd_conf.h
Added /var/jenkins_home/workspace/Betaflight Maintenance 3.5/src/main/vcp_hal/usbd_desc.c
Added /var/jenkins_home/workspace/Betaflight Maintenance 3.5/src/main/fc/rc_modes.h
Added /var/jenkins_home/workspace/Betaflight Maintenance 3.5/src/main/fc/fc_init.c
Added /var/jenkins_home/workspace/Betaflight Maintenance 3.5/src/main/fc/rc_controls.h
Added /var/jenkins_home/workspace/Betaflight Maintenance 3.5/src/main/fc/rc_adjustments.h
Added /var/jenkins_home/workspace/Betaflight Maintenance 3.5/src/main/fc/config.h
Added /var/jenkins_home/workspace/Betaflight Maintenance 3.5/src/main/fc/fc_tasks.h
Added /var/jenkins_home/workspace/Betaflight Maintenance 3.5/src/main/fc/fc_init.h
Added /var/jenkins_home/workspace/Betaflight Maintenance 3.5/src/main/fc/board_info.c
Added /var/jenkins_home/workspace/Betaflight Maintenance 3.5/src/main/fc/runtime_config.c
Added /var/jenkins_home/workspace/Betaflight Maintenance 3.5/src/main/fc/fc_core.c
Added /var/jenkins_home/workspace/Betaflight Maintenance 3.5/src/main/fc/fc_dispatch.h
Added /var/jenkins_home/workspace/Betaflight Maintenance 3.5/src/main/fc/rc_adjustments.c
Added /var/jenkins_home/workspace/Betaflight Maintenance 3.5/src/main/fc/config.c
Added /var/jenkins_home/workspace/Betaflight Maintenance 3.5/src/main/fc/fc_dispatch.c
Added /var/jenkins_home/workspace/Betaflight Maintenance 3.5/src/main/fc/fc_rc.c
Added /var/jenkins_home/workspace/Betaflight Maintenance 3.5/src/main/fc/rc_controls.c
Added /var/jenkins_home/workspace/Betaflight Maintenance 3.5/src/main/fc/controlrate_profile.c
Added /var/jenkins_home/workspace/Betaflight Maintenance 3.5/src/main/fc/fc_core.h
Added /var/jenkins_home/workspace/Betaflight Maintenance 3.5/src/main/fc/fc_hardfaults.c
Added /var/jenkins_home/workspace/Betaflight Maintenance 3.5/src/main/fc/rc_modes.c
Added /var/jenkins_home/workspace/Betaflight Maintenance 3.5/src/main/fc/fc_rc.h
Added /var/jenkins_home/workspace/Betaflight Maintenance 3.5/src/main/fc/runtime_config.h
Added /var/jenkins_home/workspace/Betaflight Maintenance 3.5/src/main/fc/board_info.h
Added /var/jenkins_home/workspace/Betaflight Maintenance 3.5/src/main/fc/controlrate_profile.h
Added /var/jenkins_home/workspace/Betaflight Maintenance 3.5/src/main/fc/fc_tasks.c
Added /var/jenkins_home/workspace/Betaflight Maintenance 3.5/src/main/msc/usbd_msc_desc.h
Added /var/jenkins_home/workspace/Betaflight Maintenance 3.5/src/main/msc/usbd_msc_desc.c
Added /var/jenkins_home/workspace/Betaflight Maintenance 3.5/src/main/msc/usbd_storage_sd_spi.c
Added /var/jenkins_home/workspace/Betaflight Maintenance 3.5/src/main/msc/emfat_file.c
Added /var/jenkins_home/workspace/Betaflight Maintenance 3.5/src/main/msc/usbd_storage.h
Added /var/jenkins_home/workspace/Betaflight Maintenance 3.5/src/main/msc/usbd_storage.c
Added /var/jenkins_home/workspace/Betaflight Maintenance 3.5/src/main/msc/emfat_file.h
Added /var/jenkins_home/workspace/Betaflight Maintenance 3.5/src/main/msc/emfat.c
Added /var/jenkins_home/workspace/Betaflight Maintenance 3.5/src/main/msc/usbd_storage_emfat.c
Added /var/jenkins_home/workspace/Betaflight Maintenance 3.5/src/main/msc/usbd_storage_sdio.c
Added /var/jenkins_home/workspace/Betaflight Maintenance 3.5/src/main/msc/usbd_storage_emfat.h
Added /var/jenkins_home/workspace/Betaflight Maintenance 3.5/src/main/msc/emfat.h
Added /var/jenkins_home/workspace/Betaflight Maintenance 3.5/src/main/build/debug.c
Added /var/jenkins_home/workspace/Betaflight Maintenance 3.5/src/main/build/build_config.c
Added /var/jenkins_home/workspace/Betaflight Maintenance 3.5/src/main/build/debug.h
Added /var/jenkins_home/workspace/Betaflight Maintenance 3.5/src/main/build/atomic.h
Added /var/jenkins_home/workspace/Betaflight Maintenance 3.5/src/main/build/version.h
Added /var/jenkins_home/workspace/Betaflight Maintenance 3.5/src/main/build/atomic.c
Added /var/jenkins_home/workspace/Betaflight Maintenance 3.5/src/main/build/build_config.h
Added /var/jenkins_home/workspace/Betaflight Maintenance 3.5/src/main/build/version.c
+ exit 0
[Betaflight Maintenance 3.5] $ /usr/share/nsiq/nsiqcollector --csv -i -l "/var/jenkins_home/workspace/Betaflight Maintenance 3.5/loc.csv" -c "/var/jenkins_home/workspace/Betaflight Maintenance 3.5/complexity.csv" "/var/jenkins_home/workspace/Betaflight Maintenance 3.5/src/main"
============================ Analyzing main ===============================

Filter Scope "default" is applied.
Current Filter Setting (Following is applied sequentially)
/.svn/ is excluded
/.cvs/ is excluded
//target/ is excluded

Current File extension and Language Settings
 JSP/PHP=jsp,php,
 Java=java,
 JavaScript/ActionScript=as,js,
 C/C++=cpp,cxx,c,h,hxx,hpp,
 Html=htm,html,


============================= Summary Report ==============================
 Product LOC - only apply filefilter.txt
 ** Total File Count       : 633
 ** Total LOC      : 130842
 ** Total Code LOC : 84369

 Delta LOC - apply both filefilter.txt and basefilelist.txt
 ** Total File Count : 633
 ** Total LOC        : 130842
 ** Total Code LOC   : 84369

 Delta Complexity - apply both filefilter.txt and basefilelist.txt
 ** Total Delta Function Count : 3629
 ** Delta Over 10 Complexity Function Rate: 271 (7.47%)
 ** Delta Over 30 Complexity Function Rate: 29 (0.80%)


 LOC Distribution Per Lang
                Lang C/C++          
  Product File Count 633            
          LOC        130842         
          Code LOC   84369          
  Delta   File Count 633            
          LOC        130842         
          Code LOC   84369          

File analysis report is saved in /var/jenkins_home/workspace/Betaflight Maintenance 3.5/loc.csv

Complexity analysis report is saved in /var/jenkins_home/workspace/Betaflight Maintenance 3.5/complexity.csv

[Betaflight Maintenance 3.5] $ /bin/bash -xe /tmp/jenkins5523606520607758020.sh
+ make arm_sdk_install
make: Nothing to be done for 'arm_sdk_install'.
[Betaflight Maintenance 3.5] $ /bin/bash -xe /tmp/jenkins8506929721125367556.sh
+ export CC=clang
+ CC=clang
+ export CXX=clang++
+ CXX=clang++
+ make junittest
cd src/test && make junittest
make[1]: Entering directory '/var/jenkins_home/workspace/Betaflight Maintenance 3.5/src/test'
compiling ../main/sensors/boardalignment.c 
compiling ../main/common/maths.c 
compiling unit/alignsensor_unittest.cc 
compiling ../../obj/test/gtest-all.o 
compiling ../../obj/test/gtest_main.o 
linking ../../obj/test/gtest_main.a 
ar: creating ../../obj/test/gtest_main.a
a - ../../obj/test/gtest-all.o
a - ../../obj/test/gtest_main.o
linking ../../obj/test/alignsensor_unittest/alignsensor_unittest 
Running main() from gtest_main.cc
[==========] Running 8 tests from 1 test case.
[----------] Global test environment set-up.
[----------] 8 tests from AlignSensorTest
[ RUN      ] AlignSensorTest.ClockwiseZeroDegrees
[       OK ] AlignSensorTest.ClockwiseZeroDegrees (0 ms)
[ RUN      ] AlignSensorTest.ClockwiseNinetyDegrees
[       OK ] AlignSensorTest.ClockwiseNinetyDegrees (0 ms)
[ RUN      ] AlignSensorTest.ClockwiseOneEightyDegrees
[       OK ] AlignSensorTest.ClockwiseOneEightyDegrees (0 ms)
[ RUN      ] AlignSensorTest.ClockwiseTwoSeventyDegrees
[       OK ] AlignSensorTest.ClockwiseTwoSeventyDegrees (0 ms)
[ RUN      ] AlignSensorTest.ClockwiseZeroDegreesFlip
[       OK ] AlignSensorTest.ClockwiseZeroDegreesFlip (0 ms)
[ RUN      ] AlignSensorTest.ClockwiseNinetyDegreesFlip
[       OK ] AlignSensorTest.ClockwiseNinetyDegreesFlip (0 ms)
[ RUN      ] AlignSensorTest.ClockwiseOneEightyDegreesFlip
[       OK ] AlignSensorTest.ClockwiseOneEightyDegreesFlip (0 ms)
[ RUN      ] AlignSensorTest.ClockwiseTwoSeventyDegreesFlip
[       OK ] AlignSensorTest.ClockwiseTwoSeventyDegreesFlip (0 ms)
[----------] 8 tests from AlignSensorTest (0 ms total)

[----------] Global test environment tear-down
[==========] 8 tests from 1 test case ran. (0 ms total)
[  PASSED  ] 8 tests.
running test_alignsensor_unittest: PASS
compiling ../main/fc/fc_core.c 
compiling ../main/fc/fc_dispatch.c 
compiling ../main/fc/rc_controls.c 
compiling ../main/fc/rc_modes.c 
compiling ../main/fc/runtime_config.c 
compiling ../main/common/bitarray.c 
compiling unit/arming_prevention_unittest.cc 
linking ../../obj/test/arming_prevention_unittest/arming_prevention_unittest 
Running main() from gtest_main.cc
[==========] Running 9 tests from 1 test case.
[----------] Global test environment set-up.
[----------] 9 tests from ArmingPreventionTest
[ RUN      ] ArmingPreventionTest.CalibrationPowerOnGraceAngleThrottleArmSwitch
[       OK ] ArmingPreventionTest.CalibrationPowerOnGraceAngleThrottleArmSwitch (0 ms)
[ RUN      ] ArmingPreventionTest.ArmingGuardRadioLeftOnAndArmed
[       OK ] ArmingPreventionTest.ArmingGuardRadioLeftOnAndArmed (0 ms)
[ RUN      ] ArmingPreventionTest.Prearm
[       OK ] ArmingPreventionTest.Prearm (0 ms)
[ RUN      ] ArmingPreventionTest.RadioTurnedOnAtAnyTimeArmed
[       OK ] ArmingPreventionTest.RadioTurnedOnAtAnyTimeArmed (0 ms)
[ RUN      ] ArmingPreventionTest.In3DModeAllowArmingWhenEnteringThrottleDeadband
[       OK ] ArmingPreventionTest.In3DModeAllowArmingWhenEnteringThrottleDeadband (0 ms)
[ RUN      ] ArmingPreventionTest.When3DModeDisabledThenNormalThrottleArmingConditionApplies
[       OK ] ArmingPreventionTest.When3DModeDisabledThenNormalThrottleArmingConditionApplies (0 ms)
[ RUN      ] ArmingPreventionTest.WhenUsingSwitched3DModeThenNormalThrottleArmingConditionApplies
[       OK ] ArmingPreventionTest.WhenUsingSwitched3DModeThenNormalThrottleArmingConditionApplies (0 ms)
[ RUN      ] ArmingPreventionTest.ParalyzeOnAtBoot
[       OK ] ArmingPreventionTest.ParalyzeOnAtBoot (0 ms)
[ RUN      ] ArmingPreventionTest.Paralyze
[       OK ] ArmingPreventionTest.Paralyze (0 ms)
[----------] 9 tests from ArmingPreventionTest (0 ms total)

[----------] Global test environment tear-down
[==========] 9 tests from 1 test case ran. (0 ms total)
[  PASSED  ] 9 tests.
running test_arming_prevention_unittest: PASS
compiling ../main/build/atomic.c 
compiling test c file: unit/atomic_unittest_c.c 
compiling unit/atomic_unittest.cc 
linking ../../obj/test/atomic_unittest/atomic_unittest 
Running main() from gtest_main.cc
[==========] Running 3 tests from 1 test case.
[----------] Global test environment set-up.
[----------] 3 tests from AtomicUnittest
[ RUN      ] AtomicUnittest.TestAtomicBlock
[       OK ] AtomicUnittest.TestAtomicBlock (0 ms)
[ RUN      ] AtomicUnittest.TestAtomicBlockNB
[       OK ] AtomicUnittest.TestAtomicBlockNB (0 ms)
[ RUN      ] AtomicUnittest.TestAtomicBarrier
[       OK ] AtomicUnittest.TestAtomicBarrier (0 ms)
[----------] 3 tests from AtomicUnittest (0 ms total)

[----------] Global test environment tear-down
[==========] 3 tests from 1 test case ran. (0 ms total)
[  PASSED  ] 3 tests.
running test_atomic_unittest: PASS
compiling ../main/drivers/barometer/barometer_bmp280.c 
compiling unit/baro_bmp280_unittest.cc 
linking ../../obj/test/baro_bmp280_unittest/baro_bmp280_unittest 
Running main() from gtest_main.cc
[==========] Running 3 tests from 1 test case.
[----------] Global test environment set-up.
[----------] 3 tests from baroBmp280Test
[ RUN      ] baroBmp280Test.TestBmp280Calculate
[       OK ] baroBmp280Test.TestBmp280Calculate (0 ms)
[ RUN      ] baroBmp280Test.TestBmp280CalculateHighP
[       OK ] baroBmp280Test.TestBmp280CalculateHighP (0 ms)
[ RUN      ] baroBmp280Test.TestBmp280CalculateZeroP
[       OK ] baroBmp280Test.TestBmp280CalculateZeroP (0 ms)
[----------] 3 tests from baroBmp280Test (0 ms total)

[----------] Global test environment tear-down
[==========] 3 tests from 1 test case ran. (0 ms total)
[  PASSED  ] 3 tests.
running test_baro_bmp280_unittest: PASS
compiling ../main/drivers/barometer/barometer_ms5611.c 
compiling unit/baro_ms5611_unittest.cc 
linking ../../obj/test/baro_ms5611_unittest/baro_ms5611_unittest 
Running main() from gtest_main.cc
[==========] Running 7 tests from 1 test case.
[----------] Global test environment set-up.
[----------] 7 tests from baroMS5611Test
[ RUN      ] baroMS5611Test.TestValidMs5611Crc
[       OK ] baroMS5611Test.TestValidMs5611Crc (0 ms)
[ RUN      ] baroMS5611Test.TestInvalidMs5611Crc
[       OK ] baroMS5611Test.TestInvalidMs5611Crc (0 ms)
[ RUN      ] baroMS5611Test.TestMs5611AllZeroProm
[       OK ] baroMS5611Test.TestMs5611AllZeroProm (0 ms)
[ RUN      ] baroMS5611Test.TestMs5611AllOnesProm
[       OK ] baroMS5611Test.TestMs5611AllOnesProm (0 ms)
[ RUN      ] baroMS5611Test.TestMs5611CalculatePressureGT20Deg
[       OK ] baroMS5611Test.TestMs5611CalculatePressureGT20Deg (0 ms)
[ RUN      ] baroMS5611Test.TestMs5611CalculatePressureLT20Deg
[       OK ] baroMS5611Test.TestMs5611CalculatePressureLT20Deg (0 ms)
[ RUN      ] baroMS5611Test.TestMs5611CalculatePressureLTMinus15Deg
[       OK ] baroMS5611Test.TestMs5611CalculatePressureLTMinus15Deg (0 ms)
[----------] 7 tests from baroMS5611Test (0 ms total)

[----------] Global test environment tear-down
[==========] 7 tests from 1 test case ran. (0 ms total)
[  PASSED  ] 7 tests.
running test_baro_ms5611_unittest: PASS
compiling ../main/blackbox/blackbox_encoding.c 
compiling ../main/common/encoding.c 
compiling ../main/common/printf.c 
compiling ../main/common/typeconversion.c 
compiling unit/blackbox_encoding_unittest.cc 
linking ../../obj/test/blackbox_encoding_unittest/blackbox_encoding_unittest 
Running main() from gtest_main.cc
[==========] Running 4 tests from 2 test cases.
[----------] Global test environment set-up.
[----------] 1 test from BlackboxEncodingTest
[ RUN      ] BlackboxEncodingTest.TestWriteUnsignedVB
[       OK ] BlackboxEncodingTest.TestWriteUnsignedVB (0 ms)
[----------] 1 test from BlackboxEncodingTest (0 ms total)

[----------] 3 tests from BlackboxTest
[ RUN      ] BlackboxTest.TestWriteTag2_3SVariable_BITS2
[       OK ] BlackboxTest.TestWriteTag2_3SVariable_BITS2 (0 ms)
[ RUN      ] BlackboxTest.TestWriteTag2_3SVariable_BITS554
[       OK ] BlackboxTest.TestWriteTag2_3SVariable_BITS554 (0 ms)
[ RUN      ] BlackboxTest.TestWriteTag2_3SVariable_BITS887
[       OK ] BlackboxTest.TestWriteTag2_3SVariable_BITS887 (0 ms)
[----------] 3 tests from BlackboxTest (0 ms total)

[----------] Global test environment tear-down
[==========] 4 tests from 2 test cases ran. (0 ms total)
[  PASSED  ] 4 tests.
running test_blackbox_encoding_unittest: PASS
compiling ../main/blackbox/blackbox.c 
compiling ../main/blackbox/blackbox_encoding.c 
compiling ../main/blackbox/blackbox_io.c 
compiling ../main/common/encoding.c 
compiling ../main/common/printf.c 
compiling ../main/common/maths.c 
compiling ../main/common/typeconversion.c 
compiling ../main/drivers/accgyro/gyro_sync.c 
compiling unit/blackbox_unittest.cc 
linking ../../obj/test/blackbox_unittest/blackbox_unittest 
Running main() from gtest_main.cc
[==========] Running 8 tests from 1 test case.
[----------] Global test environment set-up.
[----------] 8 tests from BlackboxTest
[ RUN      ] BlackboxTest.TestInitIntervals
[       OK ] BlackboxTest.TestInitIntervals (1 ms)
[ RUN      ] BlackboxTest.Test_500Hz
[       OK ] BlackboxTest.Test_500Hz (0 ms)
[ RUN      ] BlackboxTest.Test_1kHz
[       OK ] BlackboxTest.Test_1kHz (0 ms)
[ RUN      ] BlackboxTest.Test_2kHz
[       OK ] BlackboxTest.Test_2kHz (0 ms)
[ RUN      ] BlackboxTest.Test_8kHz
[       OK ] BlackboxTest.Test_8kHz (0 ms)
[ RUN      ] BlackboxTest.Test_zero_p_ratio
[       OK ] BlackboxTest.Test_zero_p_ratio (0 ms)
[ RUN      ] BlackboxTest.Test_CalculatePDenom
[       OK ] BlackboxTest.Test_CalculatePDenom (0 ms)
[ RUN      ] BlackboxTest.Test_CalculateRates
[       OK ] BlackboxTest.Test_CalculateRates (0 ms)
[----------] 8 tests from BlackboxTest (1 ms total)

[----------] Global test environment tear-down
[==========] 8 tests from 1 test case ran. (1 ms total)
[  PASSED  ] 8 tests.
running test_blackbox_unittest: PASS
compiling ../main/interface/cli.c 
compiling ../main/config/feature.c 
compiling ../main/pg/pg.c 
compiling ../main/common/typeconversion.c 
compiling unit/cli_unittest.cc 
linking ../../obj/test/cli_unittest/cli_unittest 
Running main() from gtest_main.cc
[==========] Running 1 test from 1 test case.
[----------] Global test environment set-up.
[----------] 1 test from CLIUnittest
[ RUN      ] CLIUnittest.TestCliSet
array_unit_test set to 123,-3,1
===============================
data[0] = 123
data[1] = -3
data[2] = 1

===============================
[       OK ] CLIUnittest.TestCliSet (0 ms)
[----------] 1 test from CLIUnittest (0 ms total)

[----------] Global test environment tear-down
[==========] 1 test from 1 test case ran. (0 ms total)
[  PASSED  ] 1 test.
running test_cli_unittest: PASS
compiling ../main/cms/cms.c 
compiling ../main/common/typeconversion.c 
compiling ../main/drivers/display.c 
compiling unit/cms_unittest.cc 
linking ../../obj/test/cms_unittest/cms_unittest 
Running main() from gtest_main.cc
[==========] Running 6 tests from 1 test case.
[----------] Global test environment set-up.
[----------] 6 tests from CMSUnittest
[ RUN      ] CMSUnittest.TestCmsDisplayPortRegister
[       OK ] CMSUnittest.TestCmsDisplayPortRegister (0 ms)
[ RUN      ] CMSUnittest.TestCmsMenuOpen
[       OK ] CMSUnittest.TestCmsMenuOpen (0 ms)
[ RUN      ] CMSUnittest.TestCmsMenuExit0
[       OK ] CMSUnittest.TestCmsMenuExit0 (0 ms)
[ RUN      ] CMSUnittest.TestCmsMenuExit1
[       OK ] CMSUnittest.TestCmsMenuExit1 (0 ms)
[ RUN      ] CMSUnittest.TestCmsMenuBack
[       OK ] CMSUnittest.TestCmsMenuBack (0 ms)
[ RUN      ] CMSUnittest.TestCmsMenuKey
[       OK ] CMSUnittest.TestCmsMenuKey (0 ms)
[----------] 6 tests from CMSUnittest (0 ms total)

[----------] Global test environment tear-down
[==========] 6 tests from 1 test case ran. (0 ms total)
[  PASSED  ] 6 tests.
running test_cms_unittest: PASS
compiling ../main/common/filter.c 
compiling ../main/common/maths.c 
compiling unit/common_filter_unittest.cc 
linking ../../obj/test/common_filter_unittest/common_filter_unittest 
Running main() from gtest_main.cc
[==========] Running 5 tests from 1 test case.
[----------] Global test environment set-up.
[----------] 5 tests from FilterUnittest
[ RUN      ] FilterUnittest.TestPt1FilterInit
[       OK ] FilterUnittest.TestPt1FilterInit (0 ms)
[ RUN      ] FilterUnittest.TestPt1FilterGain
[       OK ] FilterUnittest.TestPt1FilterGain (0 ms)
[ RUN      ] FilterUnittest.TestPt1FilterApply
[       OK ] FilterUnittest.TestPt1FilterApply (0 ms)
[ RUN      ] FilterUnittest.TestSlewFilterInit
[       OK ] FilterUnittest.TestSlewFilterInit (0 ms)
[ RUN      ] FilterUnittest.TestSlewFilter
[       OK ] FilterUnittest.TestSlewFilter (0 ms)
[----------] 5 tests from FilterUnittest (0 ms total)

[----------] Global test environment tear-down
[==========] 5 tests from 1 test case ran. (0 ms total)
[  PASSED  ] 5 tests.
running test_common_filter_unittest: PASS
compiling ../main/common/encoding.c 
compiling unit/encoding_unittest.cc 
linking ../../obj/test/encoding_unittest/encoding_unittest 
Running main() from gtest_main.cc
[==========] Running 2 tests from 1 test case.
[----------] Global test environment set-up.
[----------] 2 tests from EncodingTest
[ RUN      ] EncodingTest.ZigzagEncodingTest
[       OK ] EncodingTest.ZigzagEncodingTest (0 ms)
[ RUN      ] EncodingTest.FloatToIntEncodingTest
[       OK ] EncodingTest.FloatToIntEncodingTest (0 ms)
[----------] 2 tests from EncodingTest (0 ms total)

[----------] Global test environment tear-down
[==========] 2 tests from 1 test case ran. (0 ms total)
[  PASSED  ] 2 tests.
running test_encoding_unittest: PASS
compiling ../main/common/bitarray.c 
compiling ../main/fc/rc_modes.c 
compiling ../main/fc/runtime_config.c 
compiling ../main/flight/failsafe.c 
compiling unit/flight_failsafe_unittest.cc 
linking ../../obj/test/flight_failsafe_unittest/flight_failsafe_unittest 
Running main() from gtest_main.cc
[==========] Running 11 tests from 1 test case.
[----------] Global test environment set-up.
[----------] 11 tests from FlightFailsafeTest
[ RUN      ] FlightFailsafeTest.TestFailsafeInitialState
[       OK ] FlightFailsafeTest.TestFailsafeInitialState (0 ms)
[ RUN      ] FlightFailsafeTest.TestFailsafeStartMonitoring
[       OK ] FlightFailsafeTest.TestFailsafeStartMonitoring (0 ms)
[ RUN      ] FlightFailsafeTest.TestFailsafeFirstArmedCycle
[       OK ] FlightFailsafeTest.TestFailsafeFirstArmedCycle (0 ms)
[ RUN      ] FlightFailsafeTest.TestFailsafeNotActivatedWhenReceivingData
[       OK ] FlightFailsafeTest.TestFailsafeNotActivatedWhenReceivingData (1 ms)
[ RUN      ] FlightFailsafeTest.TestFailsafeDetectsRxLossAndStartsLanding
[       OK ] FlightFailsafeTest.TestFailsafeDetectsRxLossAndStartsLanding (1 ms)
[ RUN      ] FlightFailsafeTest.TestFailsafeCausesLanding
[       OK ] FlightFailsafeTest.TestFailsafeCausesLanding (0 ms)
[ RUN      ] FlightFailsafeTest.TestFailsafeDetectsRxLossAndJustDisarms
[       OK ] FlightFailsafeTest.TestFailsafeDetectsRxLossAndJustDisarms (0 ms)
[ RUN      ] FlightFailsafeTest.TestFailsafeSwitchModeKill
[       OK ] FlightFailsafeTest.TestFailsafeSwitchModeKill (0 ms)
[ RUN      ] FlightFailsafeTest.TestFailsafeSwitchModeStage2Drop
[       OK ] FlightFailsafeTest.TestFailsafeSwitchModeStage2Drop (0 ms)
[ RUN      ] FlightFailsafeTest.TestFailsafeSwitchModeStage2Land
[       OK ] FlightFailsafeTest.TestFailsafeSwitchModeStage2Land (0 ms)
[ RUN      ] FlightFailsafeTest.TestFailsafeNotActivatedWhenDisarmedAndRXLossIsDetected
[       OK ] FlightFailsafeTest.TestFailsafeNotActivatedWhenDisarmedAndRXLossIsDetected (0 ms)
[----------] 11 tests from FlightFailsafeTest (2 ms total)

[----------] Global test environment tear-down
[==========] 11 tests from 1 test case ran. (2 ms total)
[  PASSED  ] 11 tests.
running test_flight_failsafe_unittest: PASS
compiling ../main/common/bitarray.c 
compiling ../main/common/maths.c 
compiling ../main/config/feature.c 
compiling ../main/fc/rc_modes.c 
compiling ../main/flight/position.c 
compiling ../main/flight/imu.c 
compiling unit/flight_imu_unittest.cc 
linking ../../obj/test/flight_imu_unittest/flight_imu_unittest 
Running main() from gtest_main.cc
[==========] Running 3 tests from 1 test case.
[----------] Global test environment set-up.
[----------] 3 tests from FlightImuTest
[ RUN      ] FlightImuTest.TestCalculateRotationMatrix
[       OK ] FlightImuTest.TestCalculateRotationMatrix (0 ms)
[ RUN      ] FlightImuTest.TestUpdateEulerAngles
[       OK ] FlightImuTest.TestUpdateEulerAngles (0 ms)
[ RUN      ] FlightImuTest.TestSmallAngle
[       OK ] FlightImuTest.TestSmallAngle (0 ms)
[----------] 3 tests from FlightImuTest (0 ms total)

[----------] Global test environment tear-down
[==========] 3 tests from 1 test case ran. (0 ms total)
[  PASSED  ] 3 tests.
running test_flight_imu_unittest: PASS
compiling ../main/common/gps_conversion.c 
compiling unit/gps_conversion_unittest.cc 
linking ../../obj/test/gps_conversion_unittest/gps_conversion_unittest 
Running main() from gtest_main.cc
[==========] Running 2 tests from 1 test case.
[----------] Global test environment set-up.
[----------] 2 tests from GpsConversionTest
[ RUN      ] GpsConversionTest.GPSCoordToDegrees_BadString
[       OK ] GpsConversionTest.GPSCoordToDegrees_BadString (0 ms)
[ RUN      ] GpsConversionTest.GPSCoordToDegrees_NMEA_Values
[       OK ] GpsConversionTest.GPSCoordToDegrees_NMEA_Values (0 ms)
[----------] 2 tests from GpsConversionTest (0 ms total)

[----------] Global test environment tear-down
[==========] 2 tests from 1 test case ran. (0 ms total)
[  PASSED  ] 2 tests.
running test_gps_conversion_unittest: PASS
compiling ../main/common/huffman.c 
compiling ../main/common/huffman_table.c 
compiling unit/huffman_unittest.cc 
linking ../../obj/test/huffman_unittest/huffman_unittest 
Running main() from gtest_main.cc
[==========] Running 3 tests from 1 test case.
[----------] Global test environment set-up.
[----------] 3 tests from HuffmanUnittest
[ RUN      ] HuffmanUnittest.TestHuffmanEncode
[       OK ] HuffmanUnittest.TestHuffmanEncode (0 ms)
[ RUN      ] HuffmanUnittest.TestHuffmanEncodeStreaming
[       OK ] HuffmanUnittest.TestHuffmanEncodeStreaming (0 ms)
[ RUN      ] HuffmanUnittest.TestHuffmanDecode
[       OK ] HuffmanUnittest.TestHuffmanDecode (0 ms)
[----------] 3 tests from HuffmanUnittest (0 ms total)

[----------] Global test environment tear-down
[==========] 3 tests from 1 test case ran. (0 ms total)
[  PASSED  ] 3 tests.
running test_huffman_unittest: PASS
compiling ../main/io/serial.c 
compiling ../main/drivers/serial_pinconfig.c 
compiling unit/io_serial_unittest.cc 
linking ../../obj/test/io_serial_unittest/io_serial_unittest 
Running main() from gtest_main.cc
[==========] Running 1 test from 1 test case.
[----------] Global test environment set-up.
[----------] 1 test from IoSerialTest
[ RUN      ] IoSerialTest.TestFindPortConfig
[       OK ] IoSerialTest.TestFindPortConfig (0 ms)
[----------] 1 test from IoSerialTest (0 ms total)

[----------] Global test environment tear-down
[==========] 1 test from 1 test case ran. (0 ms total)
[  PASSED  ] 1 test.
running test_io_serial_unittest: PASS
compiling ../main/common/bitarray.c 
compiling ../main/fc/rc_modes.c 
compiling ../main/io/ledstrip.c 
compiling unit/ledstrip_unittest.cc 
linking ../../obj/test/ledstrip_unittest/ledstrip_unittest 
Running main() from gtest_main.cc
[==========] Running 4 tests from 2 test cases.
[----------] Global test environment set-up.
[----------] 3 tests from LedStripTest
[ RUN      ] LedStripTest.parseLedStripConfig
[       OK ] LedStripTest.parseLedStripConfig (0 ms)
[ RUN      ] LedStripTest.smallestGridWithCenter
[       OK ] LedStripTest.smallestGridWithCenter (0 ms)
[ RUN      ] LedStripTest.smallestGrid
[       OK ] LedStripTest.smallestGrid (0 ms)
[----------] 3 tests from LedStripTest (0 ms total)

[----------] 1 test from ColorTest
[ RUN      ] ColorTest.parseColor
[       OK ] ColorTest.parseColor (0 ms)
[----------] 1 test from ColorTest (0 ms total)

[----------] Global test environment tear-down
[==========] 4 tests from 2 test cases ran. (0 ms total)
[  PASSED  ] 4 tests.
running test_ledstrip_unittest: PASS
compiling ../main/common/maths.c 
compiling unit/maths_unittest.cc 
linking ../../obj/test/maths_unittest/maths_unittest 
Running main() from gtest_main.cc
[==========] Running 14 tests from 1 test case.
[----------] Global test environment set-up.
[----------] 14 tests from MathsUnittest
[ RUN      ] MathsUnittest.TestScaleRange
[       OK ] MathsUnittest.TestScaleRange (0 ms)
[ RUN      ] MathsUnittest.TestScaleRangeNegatives
[       OK ] MathsUnittest.TestScaleRangeNegatives (0 ms)
[ RUN      ] MathsUnittest.TestScaleRangeNegativePositive
[       OK ] MathsUnittest.TestScaleRangeNegativePositive (0 ms)
[ RUN      ] MathsUnittest.TestScaleRangeReverse
[       OK ] MathsUnittest.TestScaleRangeReverse (0 ms)
[ RUN      ] MathsUnittest.TestConstrain
[       OK ] MathsUnittest.TestConstrain (0 ms)
[ RUN      ] MathsUnittest.TestConstrainNegatives
[       OK ] MathsUnittest.TestConstrainNegatives (0 ms)
[ RUN      ] MathsUnittest.TestConstrainf
[       OK ] MathsUnittest.TestConstrainf (0 ms)
[ RUN      ] MathsUnittest.TestDegreesToRadians
[       OK ] MathsUnittest.TestDegreesToRadians (0 ms)
[ RUN      ] MathsUnittest.TestApplyDeadband
[       OK ] MathsUnittest.TestApplyDeadband (0 ms)
[ RUN      ] MathsUnittest.TestRotateVectorWithNoAngle
[       OK ] MathsUnittest.TestRotateVectorWithNoAngle (0 ms)
[ RUN      ] MathsUnittest.TestRotateVectorAroundAxis
[       OK ] MathsUnittest.TestRotateVectorAroundAxis (0 ms)
[ RUN      ] MathsUnittest.TestFastTrigonometrySinCos
sin_approx maximum absolute error = 2.801418e-06
cos_approx maximum absolute error = 3.218651e-06
[       OK ] MathsUnittest.TestFastTrigonometrySinCos (1 ms)
[ RUN      ] MathsUnittest.TestFastTrigonometryATan2
atan2_approx maximum absolute error = 7.152557e-07 rads (4.098114e-05 degree)
[       OK ] MathsUnittest.TestFastTrigonometryATan2 (0 ms)
[ RUN      ] MathsUnittest.TestFastTrigonometryACos
acos_approx maximum absolute error = 6.759167e-05 rads (3.872717e-03 degree)
[       OK ] MathsUnittest.TestFastTrigonometryACos (0 ms)
[----------] 14 tests from MathsUnittest (1 ms total)

[----------] Global test environment tear-down
[==========] 14 tests from 1 test case ran. (1 ms total)
[  PASSED  ] 14 tests.
running test_maths_unittest: PASS
compiling ../main/io/osd.c 
compiling ../main/common/typeconversion.c 
compiling ../main/drivers/display.c 
compiling ../main/common/maths.c 
compiling ../main/common/printf.c 
compiling ../main/common/time.c 
compiling ../main/fc/runtime_config.c 
compiling unit/osd_unittest.cc 
linking ../../obj/test/osd_unittest/osd_unittest 
Running main() from gtest_main.cc
[==========] Running 17 tests from 1 test case.
[----------] Global test environment set-up.
[----------] 17 tests from OsdTest
[ RUN      ] OsdTest.TestInit
[       OK ] OsdTest.TestInit (0 ms)
[ RUN      ] OsdTest.TestArm
[       OK ] OsdTest.TestArm (0 ms)
[ RUN      ] OsdTest.TestDisarm
[       OK ] OsdTest.TestDisarm (0 ms)
[ RUN      ] OsdTest.TestDisarmWithImmediateRearm
[       OK ] OsdTest.TestDisarmWithImmediateRearm (0 ms)
[ RUN      ] OsdTest.TestDisarmWithDismissStats
[       OK ] OsdTest.TestDisarmWithDismissStats (0 ms)
[ RUN      ] OsdTest.TestStatsImperial
[       OK ] OsdTest.TestStatsImperial (0 ms)
[ RUN      ] OsdTest.TestStatsMetric
[       OK ] OsdTest.TestStatsMetric (0 ms)
[ RUN      ] OsdTest.TestAlarms
[       OK ] OsdTest.TestAlarms (0 ms)
[ RUN      ] OsdTest.TestElementRssi
[       OK ] OsdTest.TestElementRssi (0 ms)
[ RUN      ] OsdTest.TestElementAmperage
[       OK ] OsdTest.TestElementAmperage (0 ms)
[ RUN      ] OsdTest.TestElementMahDrawn
[       OK ] OsdTest.TestElementMahDrawn (0 ms)
[ RUN      ] OsdTest.TestElementPower
[       OK ] OsdTest.TestElementPower (0 ms)
[ RUN      ] OsdTest.TestElementAltitude
[       OK ] OsdTest.TestElementAltitude (0 ms)
[ RUN      ] OsdTest.TestElementCoreTemperature
[       OK ] OsdTest.TestElementCoreTemperature (0 ms)
[ RUN      ] OsdTest.TestElementWarningsBattery
[       OK ] OsdTest.TestElementWarningsBattery (1 ms)
[ RUN      ] OsdTest.TestFormatTimeString
[       OK ] OsdTest.TestFormatTimeString (0 ms)
[ RUN      ] OsdTest.TestConvertTemperatureUnits
[       OK ] OsdTest.TestConvertTemperatureUnits (0 ms)
[----------] 17 tests from OsdTest (1 ms total)

[----------] Global test environment tear-down
[==========] 17 tests from 1 test case ran. (2 ms total)
[  PASSED  ] 17 tests.
running test_osd_unittest: PASS
compiling ../main/pg/pg.c 
compiling unit/pg_unittest.cc 
linking ../../obj/test/pg_unittest/pg_unittest 
Running main() from gtest_main.cc
[==========] Running 2 tests from 1 test case.
[----------] Global test environment set-up.
[----------] 2 tests from ParameterGroupsfTest
[ RUN      ] ParameterGroupsfTest.Test_pgResetAll
[       OK ] ParameterGroupsfTest.Test_pgResetAll (0 ms)
[ RUN      ] ParameterGroupsfTest.Test_pgFind
[       OK ] ParameterGroupsfTest.Test_pgFind (0 ms)
[----------] 2 tests from ParameterGroupsfTest (0 ms total)

[----------] Global test environment tear-down
[==========] 2 tests from 1 test case ran. (0 ms total)
[  PASSED  ] 2 tests.
running test_pg_unittest: PASS
compiling ../main/common/filter.c 
compiling ../main/common/maths.c 
compiling ../main/drivers/accgyro/gyro_sync.c 
compiling ../main/flight/pid.c 
compiling ../main/pg/pg.c 
compiling ../main/fc/runtime_config.c 
compiling unit/pid_unittest.cc 
linking ../../obj/test/pid_unittest/pid_unittest 
Running main() from gtest_main.cc
[==========] Running 10 tests from 1 test case.
[----------] Global test environment set-up.
[----------] 10 tests from pidControllerTest
[ RUN      ] pidControllerTest.testInitialisation
[       OK ] pidControllerTest.testInitialisation (0 ms)
[ RUN      ] pidControllerTest.testStabilisationDisabled
[       OK ] pidControllerTest.testStabilisationDisabled (0 ms)
[ RUN      ] pidControllerTest.testPidLoop
[       OK ] pidControllerTest.testPidLoop (0 ms)
[ RUN      ] pidControllerTest.testPidLevel
[       OK ] pidControllerTest.testPidLevel (0 ms)
[ RUN      ] pidControllerTest.testPidHorizon
[       OK ] pidControllerTest.testPidHorizon (0 ms)
[ RUN      ] pidControllerTest.testMixerSaturation
[       OK ] pidControllerTest.testMixerSaturation (0 ms)
[ RUN      ] pidControllerTest.testCrashRecoveryMode
[       OK ] pidControllerTest.testCrashRecoveryMode (0 ms)
[ RUN      ] pidControllerTest.pidSetpointTransition
[       OK ] pidControllerTest.pidSetpointTransition (0 ms)
[ RUN      ] pidControllerTest.testDtermFiltering
[       OK ] pidControllerTest.testDtermFiltering (0 ms)
[ RUN      ] pidControllerTest.testItermRotationHandling
[       OK ] pidControllerTest.testItermRotationHandling (0 ms)
[----------] 10 tests from pidControllerTest (0 ms total)

[----------] Global test environment tear-down
[==========] 10 tests from 1 test case ran. (1 ms total)
[  PASSED  ] 10 tests.
running test_pid_unittest: PASS
compiling ../main/fc/rc_controls.c 
compiling ../main/pg/pg.c 
compiling ../main/common/bitarray.c 
compiling ../main/common/maths.c 
compiling ../main/fc/rc_adjustments.c 
compiling ../main/fc/rc_modes.c 
compiling unit/rc_controls_unittest.cc 
linking ../../obj/test/rc_controls_unittest/rc_controls_unittest 
Running main() from gtest_main.cc
[==========] Running 6 tests from 2 test cases.
[----------] Global test environment set-up.
[----------] 2 tests from RcControlsModesTest
[ RUN      ] RcControlsModesTest.updateActivatedModesWithAllInputsAtMidde
[       OK ] RcControlsModesTest.updateActivatedModesWithAllInputsAtMidde (0 ms)
[ RUN      ] RcControlsModesTest.updateActivatedModesUsingValidAuxConfigurationAndRXValues
[       OK ] RcControlsModesTest.updateActivatedModesUsingValidAuxConfigurationAndRXValues (0 ms)
[----------] 2 tests from RcControlsModesTest (0 ms total)

[----------] 4 tests from RcControlsAdjustmentsTest
[ RUN      ] RcControlsAdjustmentsTest.processRcAdjustmentsSticksInMiddle
[       OK ] RcControlsAdjustmentsTest.processRcAdjustmentsSticksInMiddle (0 ms)
[ RUN      ] RcControlsAdjustmentsTest.processRcAdjustmentsWithRcRateFunctionSwitchUp
[       OK ] RcControlsAdjustmentsTest.processRcAdjustmentsWithRcRateFunctionSwitchUp (0 ms)
[ RUN      ] RcControlsAdjustmentsTest.processRcRateProfileAdjustments
[       OK ] RcControlsAdjustmentsTest.processRcRateProfileAdjustments (0 ms)
[ RUN      ] RcControlsAdjustmentsTest.processPIDIncreasePidController0
[       OK ] RcControlsAdjustmentsTest.processPIDIncreasePidController0 (0 ms)
[----------] 4 tests from RcControlsAdjustmentsTest (0 ms total)

[----------] Global test environment tear-down
[==========] 6 tests from 2 test cases ran. (0 ms total)
[  PASSED  ] 6 tests.
running test_rc_controls_unittest: PASS
compiling ../main/common/crc.c 
compiling ../main/common/bitarray.c 
compiling ../main/fc/rc_modes.c 
compiling ../main/io/rcdevice.c 
compiling ../main/io/rcdevice_cam.c 
compiling unit/rcdevice_unittest.cc 
linking ../../obj/test/rcdevice_unittest/rcdevice_unittest 
Running main() from gtest_main.cc
[==========] Running 9 tests from 1 test case.
[----------] Global test environment set-up.
[----------] 9 tests from RCDeviceTest
[ RUN      ] RCDeviceTest.TestRCSplitInitWithoutPortConfigurated
[       OK ] RCDeviceTest.TestRCSplitInitWithoutPortConfigurated (0 ms)
[ RUN      ] RCDeviceTest.TestRCSplitInitWithoutOpenPortConfigurated
[       OK ] RCDeviceTest.TestRCSplitInitWithoutOpenPortConfigurated (0 ms)
[ RUN      ] RCDeviceTest.TestInitDevice
[       OK ] RCDeviceTest.TestInitDevice (0 ms)
[ RUN      ] RCDeviceTest.TestInitDeviceWithInvalidResponse
[       OK ] RCDeviceTest.TestInitDeviceWithInvalidResponse (0 ms)
[ RUN      ] RCDeviceTest.TestWifiModeChangeWithDeviceUnready
[       OK ] RCDeviceTest.TestWifiModeChangeWithDeviceUnready (0 ms)
[ RUN      ] RCDeviceTest.TestWifiModeChangeWithDeviceReady
[       OK ] RCDeviceTest.TestWifiModeChangeWithDeviceReady (0 ms)
[ RUN      ] RCDeviceTest.TestWifiModeChangeCombine
[       OK ] RCDeviceTest.TestWifiModeChangeCombine (0 ms)
[ RUN      ] RCDeviceTest.Test5KeyOSDCableSimulationProtocol
[       OK ] RCDeviceTest.Test5KeyOSDCableSimulationProtocol (0 ms)
[ RUN      ] RCDeviceTest.Test5KeyOSDCableSimulationWithout5KeyFeatureSupport
[       OK ] RCDeviceTest.Test5KeyOSDCableSimulationWithout5KeyFeatureSupport (0 ms)
[----------] 9 tests from RCDeviceTest (0 ms total)

[----------] Global test environment tear-down
[==========] 9 tests from 1 test case ran. (0 ms total)
[  PASSED  ] 9 tests.
running test_rcdevice_unittest: PASS
compiling ../main/rx/crsf.c 
compiling ../main/common/crc.c 
compiling ../main/common/printf.c 
compiling ../main/common/typeconversion.c 
compiling ../main/common/streambuf.c 
compiling ../main/drivers/serial.c 
compiling unit/rx_crsf_unittest.cc 
linking ../../obj/test/rx_crsf_unittest/rx_crsf_unittest 
Running main() from gtest_main.cc
[==========] Running 5 tests from 1 test case.
[----------] Global test environment set-up.
[----------] 5 tests from CrossFireTest
[ RUN      ] CrossFireTest.CRC
[       OK ] CrossFireTest.CRC (0 ms)
[ RUN      ] CrossFireTest.TestCrsfFrameStatus
[       OK ] CrossFireTest.TestCrsfFrameStatus (0 ms)
[ RUN      ] CrossFireTest.TestCrsfFrameStatusUnpacking
[       OK ] CrossFireTest.TestCrsfFrameStatusUnpacking (0 ms)
[ RUN      ] CrossFireTest.TestCapturedData
[       OK ] CrossFireTest.TestCapturedData (0 ms)
[ RUN      ] CrossFireTest.TestCrsfDataReceive
[       OK ] CrossFireTest.TestCrsfDataReceive (0 ms)
[----------] 5 tests from CrossFireTest (0 ms total)

[----------] Global test environment tear-down
[==========] 5 tests from 1 test case ran. (0 ms total)
[  PASSED  ] 5 tests.
running test_rx_crsf_unittest: PASS
compiling ../main/rx/ibus.c 
compiling unit/rx_ibus_unittest.cc 
linking ../../obj/test/rx_ibus_unittest/rx_ibus_unittest 
Running main() from gtest_main.cc
[==========] Running 12 tests from 2 test cases.
[----------] Global test environment set-up.
[----------] 2 tests from IbusRxInitUnitTest
[ RUN      ] IbusRxInitUnitTest.Test_IbusRxNotEnabled
[       OK ] IbusRxInitUnitTest.Test_IbusRxNotEnabled (0 ms)
[ RUN      ] IbusRxInitUnitTest.Test_IbusRxEnabled
[       OK ] IbusRxInitUnitTest.Test_IbusRxEnabled (0 ms)
[----------] 2 tests from IbusRxInitUnitTest (0 ms total)

[----------] 10 tests from IbusRxProtocollUnitTest
[ RUN      ] IbusRxProtocollUnitTest.Test_InitialFrameState
[       OK ] IbusRxProtocollUnitTest.Test_InitialFrameState (0 ms)
[ RUN      ] IbusRxProtocollUnitTest.Test_IA6B_OnePacketReceived
[       OK ] IbusRxProtocollUnitTest.Test_IA6B_OnePacketReceived (0 ms)
[ RUN      ] IbusRxProtocollUnitTest.Test_IA6B_OnePacketReceivedWithBadCrc
[       OK ] IbusRxProtocollUnitTest.Test_IA6B_OnePacketReceivedWithBadCrc (0 ms)
[ RUN      ] IbusRxProtocollUnitTest.Test_IA6B_HalfPacketReceived_then_interPacketGapReset
[       OK ] IbusRxProtocollUnitTest.Test_IA6B_HalfPacketReceived_then_interPacketGapReset (0 ms)
[ RUN      ] IbusRxProtocollUnitTest.Test_IA6_OnePacketReceived
[       OK ] IbusRxProtocollUnitTest.Test_IA6_OnePacketReceived (0 ms)
[ RUN      ] IbusRxProtocollUnitTest.Test_IA6_OnePacketReceivedBadCrc
[       OK ] IbusRxProtocollUnitTest.Test_IA6_OnePacketReceivedBadCrc (0 ms)
[ RUN      ] IbusRxProtocollUnitTest.Test_IA6B_OnePacketReceived_not_shared_port
[       OK ] IbusRxProtocollUnitTest.Test_IA6B_OnePacketReceived_not_shared_port (0 ms)
[ RUN      ] IbusRxProtocollUnitTest.Test_OneTelemetryPacketReceived
[       OK ] IbusRxProtocollUnitTest.Test_OneTelemetryPacketReceived (0 ms)
[ RUN      ] IbusRxProtocollUnitTest.Test_OneTelemetryIgnoreTxEchoToRx
[       OK ] IbusRxProtocollUnitTest.Test_OneTelemetryIgnoreTxEchoToRx (0 ms)
[ RUN      ] IbusRxProtocollUnitTest.Test_OneTelemetryShouldNotIgnoreTxEchoAfterInterFrameGap
[       OK ] IbusRxProtocollUnitTest.Test_OneTelemetryShouldNotIgnoreTxEchoAfterInterFrameGap (0 ms)
[----------] 10 tests from IbusRxProtocollUnitTest (0 ms total)

[----------] Global test environment tear-down
[==========] 12 tests from 2 test cases ran. (1 ms total)
[  PASSED  ] 12 tests.
running test_rx_ibus_unittest: PASS
compiling ../main/common/bitarray.c 
compiling ../main/common/maths.c 
compiling ../main/fc/rc_modes.c 
compiling ../main/rx/rx.c 
compiling ../main/pg/pg.c 
compiling ../main/pg/rx.c 
compiling unit/rx_ranges_unittest.cc 
linking ../../obj/test/rx_ranges_unittest/rx_ranges_unittest 
Running main() from gtest_main.cc
[==========] Running 1 test from 1 test case.
[----------] Global test environment set-up.
[----------] 1 test from RxChannelRangeTest
[ RUN      ] RxChannelRangeTest.TestRxChannelRanges
[       OK ] RxChannelRangeTest.TestRxChannelRanges (0 ms)
[----------] 1 test from RxChannelRangeTest (0 ms total)

[----------] Global test environment tear-down
[==========] 1 test from 1 test case ran. (0 ms total)
[  PASSED  ] 1 test.
running test_rx_ranges_unittest: PASS
compiling ../main/rx/rx.c 
compiling ../main/fc/rc_modes.c 
compiling ../main/common/bitarray.c 
compiling ../main/common/maths.c 
compiling ../main/config/feature.c 
compiling ../main/pg/rx.c 
compiling unit/rx_rx_unittest.cc 
linking ../../obj/test/rx_rx_unittest/rx_rx_unittest 
Running main() from gtest_main.cc
[==========] Running 0 tests from 0 test cases.
[==========] 0 tests from 0 test cases ran. (0 ms total)
[  PASSED  ] 0 tests.
running test_rx_rx_unittest: PASS
compiling ../main/scheduler/scheduler.c 
compiling ../main/common/crc.c 
compiling ../main/common/streambuf.c 
compiling unit/scheduler_unittest.cc 
linking ../../obj/test/scheduler_unittest/scheduler_unittest 
Running main() from gtest_main.cc
[==========] Running 9 tests from 1 test case.
[----------] Global test environment set-up.
[----------] 9 tests from SchedulerUnittest
[ RUN      ] SchedulerUnittest.TestPriorites
[       OK ] SchedulerUnittest.TestPriorites (0 ms)
[ RUN      ] SchedulerUnittest.TestQueueInit
[       OK ] SchedulerUnittest.TestQueueInit (0 ms)
[ RUN      ] SchedulerUnittest.TestQueue
[       OK ] SchedulerUnittest.TestQueue (0 ms)
[ RUN      ] SchedulerUnittest.TestQueueAddAndRemove
[       OK ] SchedulerUnittest.TestQueueAddAndRemove (0 ms)
[ RUN      ] SchedulerUnittest.TestQueueArray
[       OK ] SchedulerUnittest.TestQueueArray (0 ms)
[ RUN      ] SchedulerUnittest.TestSchedulerInit
[       OK ] SchedulerUnittest.TestSchedulerInit (0 ms)
[ RUN      ] SchedulerUnittest.TestScheduleEmptyQueue
[       OK ] SchedulerUnittest.TestScheduleEmptyQueue (0 ms)
[ RUN      ] SchedulerUnittest.TestSingleTask
[       OK ] SchedulerUnittest.TestSingleTask (0 ms)
[ RUN      ] SchedulerUnittest.TestTwoTasks
[       OK ] SchedulerUnittest.TestTwoTasks (0 ms)
[----------] 9 tests from SchedulerUnittest (0 ms total)

[----------] Global test environment tear-down
[==========] 9 tests from 1 test case ran. (0 ms total)
[  PASSED  ] 9 tests.
running test_scheduler_unittest: PASS
compiling ../main/sensors/gyro.c 
compiling ../main/sensors/boardalignment.c 
compiling ../main/common/filter.c 
compiling ../main/common/maths.c 
compiling ../main/drivers/accgyro/accgyro_fake.c 
compiling ../main/drivers/accgyro/gyro_sync.c 
compiling ../main/pg/pg.c 
compiling unit/sensor_gyro_unittest.cc 
linking ../../obj/test/sensor_gyro_unittest/sensor_gyro_unittest 
Running main() from gtest_main.cc
[==========] Running 5 tests from 1 test case.
[----------] Global test environment set-up.
[----------] 5 tests from SensorGyro
[ RUN      ] SensorGyro.Detect
[       OK ] SensorGyro.Detect (0 ms)
[ RUN      ] SensorGyro.Init
[       OK ] SensorGyro.Init (0 ms)
[ RUN      ] SensorGyro.Read
[       OK ] SensorGyro.Read (0 ms)
[ RUN      ] SensorGyro.Calibrate
[       OK ] SensorGyro.Calibrate (1 ms)
[ RUN      ] SensorGyro.Update
[       OK ] SensorGyro.Update (0 ms)
[----------] 5 tests from SensorGyro (1 ms total)

[----------] Global test environment tear-down
[==========] 5 tests from 1 test case ran. (1 ms total)
[  PASSED  ] 5 tests.
running test_sensor_gyro_unittest: PASS
compiling ../main/rx/crsf.c 
compiling ../main/build/atomic.c 
compiling ../main/common/crc.c 
compiling ../main/common/streambuf.c 
compiling ../main/common/printf.c 
compiling ../main/drivers/serial.c 
compiling ../main/common/typeconversion.c 
compiling ../main/telemetry/crsf.c 
compiling ../main/common/gps_conversion.c 
compiling ../main/telemetry/msp_shared.c 
compiling ../main/fc/runtime_config.c 
compiling unit/telemetry_crsf_msp_unittest.cc 
linking ../../obj/test/telemetry_crsf_msp_unittest/telemetry_crsf_msp_unittest 
Running main() from gtest_main.cc
[==========] Running 4 tests from 1 test case.
[----------] Global test environment set-up.
[----------] 4 tests from CrossFireMSPTest
[ RUN      ] CrossFireMSPTest.RequestBufferTest
[       OK ] CrossFireMSPTest.RequestBufferTest (0 ms)
[ RUN      ] CrossFireMSPTest.ResponsePacketTest
[       OK ] CrossFireMSPTest.ResponsePacketTest (0 ms)
[ RUN      ] CrossFireMSPTest.WriteResponseTest
[       OK ] CrossFireMSPTest.WriteResponseTest (0 ms)
[ RUN      ] CrossFireMSPTest.SendMspReply
[       OK ] CrossFireMSPTest.SendMspReply (0 ms)
[----------] 4 tests from CrossFireMSPTest (0 ms total)

[----------] Global test environment tear-down
[==========] 4 tests from 1 test case ran. (0 ms total)
[  PASSED  ] 4 tests.
running test_telemetry_crsf_msp_unittest: PASS
compiling ../main/rx/crsf.c 
compiling ../main/telemetry/crsf.c 
compiling ../main/common/crc.c 
compiling ../main/common/maths.c 
compiling ../main/common/streambuf.c 
compiling ../main/common/gps_conversion.c 
compiling ../main/common/printf.c 
compiling ../main/common/typeconversion.c 
compiling ../main/fc/runtime_config.c 
compiling unit/telemetry_crsf_unittest.cc 
linking ../../obj/test/telemetry_crsf_unittest/telemetry_crsf_unittest 
Running main() from gtest_main.cc
[==========] Running 4 tests from 1 test case.
[----------] Global test environment set-up.
[----------] 4 tests from TelemetryCrsfTest
[ RUN      ] TelemetryCrsfTest.TestGPS
[       OK ] TelemetryCrsfTest.TestGPS (0 ms)
[ RUN      ] TelemetryCrsfTest.TestBattery
[       OK ] TelemetryCrsfTest.TestBattery (0 ms)
[ RUN      ] TelemetryCrsfTest.TestAttitude
[       OK ] TelemetryCrsfTest.TestAttitude (0 ms)
[ RUN      ] TelemetryCrsfTest.TestFlightMode
[       OK ] TelemetryCrsfTest.TestFlightMode (0 ms)
[----------] 4 tests from TelemetryCrsfTest (0 ms total)

[----------] Global test environment tear-down
[==========] 4 tests from 1 test case ran. (0 ms total)
[  PASSED  ] 4 tests.
running test_telemetry_crsf_unittest: PASS
compiling ../main/telemetry/hott.c 
compiling ../main/common/gps_conversion.c 
compiling unit/telemetry_hott_unittest.cc 
linking ../../obj/test/telemetry_hott_unittest/telemetry_hott_unittest 
Running main() from gtest_main.cc
[==========] Running 3 tests from 1 test case.
[----------] Global test environment set-up.
[----------] 3 tests from TelemetryHottTest
[ RUN      ] TelemetryHottTest.UpdateGPSCoordinates1
[       OK ] TelemetryHottTest.UpdateGPSCoordinates1 (0 ms)
[ RUN      ] TelemetryHottTest.UpdateGPSCoordinates2
[       OK ] TelemetryHottTest.UpdateGPSCoordinates2 (0 ms)
[ RUN      ] TelemetryHottTest.UpdateGPSCoordinates3
[       OK ] TelemetryHottTest.UpdateGPSCoordinates3 (0 ms)
[----------] 3 tests from TelemetryHottTest (0 ms total)

[----------] Global test environment tear-down
[==========] 3 tests from 1 test case ran. (0 ms total)
[  PASSED  ] 3 tests.
running test_telemetry_hott_unittest: PASS
compiling ../main/telemetry/ibus_shared.c 
compiling ../main/telemetry/ibus.c 
compiling unit/telemetry_ibus_unittest.cc 
linking ../../obj/test/telemetry_ibus_unittest/telemetry_ibus_unittest 
Running main() from gtest_main.cc
[==========] Running 17 tests from 3 test cases.
[----------] Global test environment set-up.
[----------] 3 tests from IbusTelemteryInitUnitTest
[ RUN      ] IbusTelemteryInitUnitTest.Test_IbusInitNotEnabled
[       OK ] IbusTelemteryInitUnitTest.Test_IbusInitNotEnabled (0 ms)
[ RUN      ] IbusTelemteryInitUnitTest.Test_IbusInitEnabled
[       OK ] IbusTelemteryInitUnitTest.Test_IbusInitEnabled (0 ms)
[ RUN      ] IbusTelemteryInitUnitTest.Test_IbusInitSerialRxAndTelemetryEnabled
[       OK ] IbusTelemteryInitUnitTest.Test_IbusInitSerialRxAndTelemetryEnabled (0 ms)
[----------] 3 tests from IbusTelemteryInitUnitTest (0 ms total)

[----------] 10 tests from IbusTelemteryProtocolUnitTest
[ RUN      ] IbusTelemteryProtocolUnitTest.Test_IbusNoRespondToDiscoveryCrcErr
[       OK ] IbusTelemteryProtocolUnitTest.Test_IbusNoRespondToDiscoveryCrcErr (0 ms)
[ RUN      ] IbusTelemteryProtocolUnitTest.Test_IbusRespondToDiscovery
[       OK ] IbusTelemteryProtocolUnitTest.Test_IbusRespondToDiscovery (0 ms)
[ RUN      ] IbusTelemteryProtocolUnitTest.Test_IbusRespondToSensorTypeQueryVbatt
[       OK ] IbusTelemteryProtocolUnitTest.Test_IbusRespondToSensorTypeQueryVbatt (0 ms)
[ RUN      ] IbusTelemteryProtocolUnitTest.Test_IbusRespondToSensorTypeQueryTemperature
[       OK ] IbusTelemteryProtocolUnitTest.Test_IbusRespondToSensorTypeQueryTemperature (0 ms)
[ RUN      ] IbusTelemteryProtocolUnitTest.Test_IbusRespondToSensorTypeQueryRpm
[       OK ] IbusTelemteryProtocolUnitTest.Test_IbusRespondToSensorTypeQueryRpm (0 ms)
[ RUN      ] IbusTelemteryProtocolUnitTest.Test_IbusRespondToGetMeasurementVbattZero
[       OK ] IbusTelemteryProtocolUnitTest.Test_IbusRespondToGetMeasurementVbattZero (0 ms)
[ RUN      ] IbusTelemteryProtocolUnitTest.Test_IbusRespondToGetMeasurementVbattCellVoltage
[       OK ] IbusTelemteryProtocolUnitTest.Test_IbusRespondToGetMeasurementVbattCellVoltage (0 ms)
[ RUN      ] IbusTelemteryProtocolUnitTest.Test_IbusRespondToGetMeasurementVbattPackVoltage
[       OK ] IbusTelemteryProtocolUnitTest.Test_IbusRespondToGetMeasurementVbattPackVoltage (0 ms)
[ RUN      ] IbusTelemteryProtocolUnitTest.Test_IbusRespondToGetMeasurementTemperature
[       OK ] IbusTelemteryProtocolUnitTest.Test_IbusRespondToGetMeasurementTemperature (0 ms)
[ RUN      ] IbusTelemteryProtocolUnitTest.Test_IbusRespondToGetMeasurementRpm
[       OK ] IbusTelemteryProtocolUnitTest.Test_IbusRespondToGetMeasurementRpm (0 ms)
[----------] 10 tests from IbusTelemteryProtocolUnitTest (0 ms total)

[----------] 4 tests from IbusTelemteryProtocolUnitTestDaisyChained
[ RUN      ] IbusTelemteryProtocolUnitTestDaisyChained.Test_IbusRespondToDiscoveryBaseAddressThree
[       OK ] IbusTelemteryProtocolUnitTestDaisyChained.Test_IbusRespondToDiscoveryBaseAddressThree (0 ms)
[ RUN      ] IbusTelemteryProtocolUnitTestDaisyChained.Test_IbusRespondToSensorTypeQueryWrongAddress
[       OK ] IbusTelemteryProtocolUnitTestDaisyChained.Test_IbusRespondToSensorTypeQueryWrongAddress (0 ms)
[ RUN      ] IbusTelemteryProtocolUnitTestDaisyChained.Test_IbusRespondToSensorTypeQueryVbattBaseThree
[       OK ] IbusTelemteryProtocolUnitTestDaisyChained.Test_IbusRespondToSensorTypeQueryVbattBaseThree (0 ms)
[ RUN      ] IbusTelemteryProtocolUnitTestDaisyChained.Test_IbusRespondToGetMeasurementsBaseThree
[       OK ] IbusTelemteryProtocolUnitTestDaisyChained.Test_IbusRespondToGetMeasurementsBaseThree (0 ms)
[----------] 4 tests from IbusTelemteryProtocolUnitTestDaisyChained (0 ms total)

[----------] Global test environment tear-down
[==========] 17 tests from 3 test cases ran. (0 ms total)
[  PASSED  ] 17 tests.
running test_telemetry_ibus_unittest: PASS
compiling ../main/drivers/transponder_ir_ilap.c 
compiling ../main/drivers/transponder_ir_arcitimer.c 
compiling unit/transponder_ir_unittest.cc 
linking ../../obj/test/transponder_ir_unittest/transponder_ir_unittest 
Running main() from gtest_main.cc
[==========] Running 2 tests from 1 test case.
[----------] Global test environment set-up.
[----------] 2 tests from transponderTest
[ RUN      ] transponderTest.updateTransponderDMABufferArcitimer
[       OK ] transponderTest.updateTransponderDMABufferArcitimer (1 ms)
[ RUN      ] transponderTest.updateTransponderDMABufferIlap
[       OK ] transponderTest.updateTransponderDMABufferIlap (0 ms)
[----------] 2 tests from transponderTest (1 ms total)

[----------] Global test environment tear-down
[==========] 2 tests from 1 test case ran. (1 ms total)
[  PASSED  ] 2 tests.
running test_transponder_ir_unittest: PASS
compiling ../main/fc/fc_core.c 
compiling ../main/fc/fc_dispatch.c 
compiling ../main/fc/rc_controls.c 
compiling ../main/fc/rc_modes.c 
compiling ../main/fc/runtime_config.c 
compiling ../main/drivers/vtx_common.c 
compiling ../main/io/vtx_control.c 
compiling ../main/io/vtx_string.c 
compiling ../main/io/vtx.c 
compiling ../main/common/bitarray.c 
compiling unit/vtx_unittest.cc 
linking ../../obj/test/vtx_unittest/vtx_unittest 
Running main() from gtest_main.cc
[==========] Running 1 test from 1 test case.
[----------] Global test environment set-up.
[----------] 1 test from VtxTest
[ RUN      ] VtxTest.PitMode
[       OK ] VtxTest.PitMode (0 ms)
[----------] 1 test from VtxTest (0 ms total)

[----------] Global test environment tear-down
[==========] 1 test from 1 test case ran. (0 ms total)
[  PASSED  ] 1 test.
running test_vtx_unittest: PASS
compiling ../main/drivers/light_ws2811strip.c 
compiling unit/ws2811_unittest.cc 
linking ../../obj/test/ws2811_unittest/ws2811_unittest 
Running main() from gtest_main.cc
[==========] Running 1 test from 1 test case.
[----------] Global test environment set-up.
[----------] 1 test from WS2812
[ RUN      ] WS2812.updateDMABuffer
[       OK ] WS2812.updateDMABuffer (0 ms)
[----------] 1 test from WS2812 (0 ms total)

[----------] Global test environment tear-down
[==========] 1 test from 1 test case ran. (0 ms total)
[  PASSED  ] 1 test.
running test_ws2811_unittest: PASS
make[1]: Leaving directory '/var/jenkins_home/workspace/Betaflight Maintenance 3.5/src/test'
[Betaflight Maintenance 3.5] $ /bin/bash -xe /tmp/jenkins476140379612284742.sh
+ V=0
+ make all
Building AG3XF4
Memory region         Used Size  Region Size  %age Used
           FLASH:       12548 B        16 KB     76.59%
    FLASH_CONFIG:          0 GB        16 KB      0.00%
          FLASH1:      326712 B       992 KB     32.16%
   SYSTEM_MEMORY:          0 GB        29 KB      0.00%
             RAM:       66776 B       128 KB     50.95%
             CCM:        8404 B        64 KB     12.82%
     BACKUP_SRAM:          0 GB         4 KB      0.00%
       MEMORY_B1:          0 GB         0 GB      -nan%
   text	   data	    bss	    dec	    hex	filename
 328880	  10380	  64796	 404056	  62a58	./obj/main/betaflight_AG3XF4.elf
Building AG3XF4 succeeded.
Building AG3XF7
Memory region         Used Size  Region Size  %age Used
        ITCM_RAM:       12112 B        16 KB     73.93%
      ITCM_FLASH:          0 GB        16 KB      0.00%
ITCM_FLASH_CONFIG:          0 GB        16 KB      0.00%
     ITCM_FLASH1:          0 GB       480 KB      0.00%
      AXIM_FLASH:       12814 B        16 KB     78.21%
AXIM_FLASH_CONFIG:          0 GB        16 KB      0.00%
     AXIM_FLASH1:      344008 B       480 KB     69.99%
        DTCM_RAM:       16688 B        64 KB     25.46%
           SRAM1:       58524 B       176 KB     32.47%
           SRAM2:          0 GB        16 KB      0.00%
       MEMORY_B1:          0 GB         0 GB      -nan%
   text	   data	    bss	    dec	    hex	filename
 346270	  10552	  64660	 421482	  66e6a	./obj/main/betaflight_AG3XF7.elf
Building AG3XF7 succeeded.
Building AIKONF4
Memory region         Used Size  Region Size  %age Used
           FLASH:       12314 B        16 KB     75.16%
    FLASH_CONFIG:          0 GB        16 KB      0.00%
          FLASH1:      321912 B       992 KB     31.69%
   SYSTEM_MEMORY:          0 GB        29 KB      0.00%
             RAM:       63372 B       128 KB     48.35%
             CCM:        7408 B        64 KB     11.30%
     BACKUP_SRAM:          0 GB         4 KB      0.00%
       MEMORY_B1:          0 GB         0 GB      -nan%
   text	   data	    bss	    dec	    hex	filename
 324014	  10212	  60564	 394790	  60626	./obj/main/betaflight_AIKONF4.elf
Building AIKONF4 succeeded.
Building AIORACERF3
Memory region         Used Size  Region Size  %age Used
           FLASH:      258092 B       252 KB    100.02%
    FLASH_CONFIG:          0 GB         4 KB      0.00%
             RAM:       38836 B        40 KB     94.81%
             CCM:          2 KB         8 KB     25.00%
       MEMORY_B1:          0 GB         0 GB      -nan/var/jenkins_home/workspace/Betaflight Maintenance 3.5/tools/gcc-arm-none-eabi-7-2017-q4-major/bin/../lib/gcc/arm-none-eabi/7.2.1/../../../../arm-none-eabi/bin/ld: obj/main/betaflight_AIORACERF3.elf section `.data' will not fit in region `FLASH'
/var/jenkins_home/workspace/Betaflight Maintenance 3.5/tools/gcc-arm-none-eabi-7-2017-q4-major/bin/../lib/gcc/arm-none-eabi/7.2.1/../../../../arm-none-eabi/bin/ld: region `FLASH' overflowed by 44 bytes
collect2: error: ld returned 1 exit status
%
Makefile:293: recipe for target 'obj/main/betaflight_AIORACERF3.elf' failed
make[2]: *** [obj/main/betaflight_AIORACERF3.elf] Error 1
Makefile:412: recipe for target 'binary' failed
make[1]: *** [binary] Error 2
Makefile:356: recipe for target 'AIORACERF3' failed
make: *** [AIORACERF3] Error 2
Build step 'Execute shell' marked build as failure
[DRY] Skipping publisher since build result is FAILURE
[WARNINGS] Skipping publisher since build result is FAILURE
Skipped archiving because build is not successful
Build step 'Publish N'SIQ Collector' marked build as failure
Recording test results
Finished: FAILURE